{"text_format":"1","workbook":"xlsx","n_sheets":18,"sheets":["Tiedote","Etusivu","Tulot","Hank.työ 1","Hank.työ 2","Menot","Ajopäiv.","Arvionvaraiset","Poistot","Velat","Luovutusv.","Varaukset","Vähennys","2C","ALV-kausivero","Metsätalouden Tulos","Sähköinen ilmoittaminen","OHJE Sähk.ilm."],"not_rendered":{"charts":0,"images":5,"macros":1,"external_links":0,"defined_names":39,"comments":18,"pivot_tables":0},"unopened":[],"bounds":{"document_bytes":16777216,"sheet_cells":100000,"rows_first":2000,"rows_last":500,"rows_between":2000,"halvings":0,"cell_chars":16384,"cell_head_chars":4096},"cells_cut":0,"cells_raw":0,"read":"whole","date_system":"1900"}

{"sheet":"Tiedote","index":0,"n_rows":265,"n_cols":5,"rows_kept":265,"cut":false,"hidden":false,"merged":[[1,6,1,7],[187,1,187,4],[1,1,1,2],[185,1,185,4],[186,1,186,4]]}
[]
[null,"Mette 2016          Metsätalouden kirjanpito-ohjelma",null,"Rajoitettu maksuton testiversio"]
[null,"Mette 2016 versio 16.10",null,"Tiedostoa saa kopioida"]
[null,"Version päiväys 22.9.2016",null,null,"© Forwood"]
[]
[]
[null,"Mette 2016 ohjelman saat ladattua verkkokaupastamme www.metsavero.fi"]
[null,"Maksettuasi käyttömaksun verkkokaupassa, saat latauslinkin, josta voit ladata ohjelman. "]
[null,"Saat sähköpostiisi lataustunnuksen, jolla voit ladata mahdolliset tulevat ohjelman päivitysversiot."]
[null,"Yksi maksu oikeuttaa käyttämään ohjelmaa yhden verovuoden maksajan metsätiloilla ja kattaa kaikki päivitykset verovuoden ajalta. "]
[]
[null,"Mette metsätalouden kirjanpito-ohjelma on saatavilla osoitteesta  www.metsavero.fi tai www.mette.fi"]
[]
[null,"Tämän kirjanpitotaulukon käyttäjä käyttää kirjanpitotaulukkoa omalla vastuullaan.  "]
[null,"Forwood ei vastaa tämän Mette metsätalouden kirjanpito-ohjelman mahdollisista virheistä ja puutteista aiheutuvista vahingoista."]
[]
[null,"Kehittämisehdotuksia ja palautetta voi lähettää sähköpostitse osoitteeseen "]
[]
[null,"Yhdellä käyttömaksulla ohjelmaa voi käyttää verovuoden ajan seuraavasti:"]
[null," - puolisoiden kaikilla tiloilla, joista tehdään yksi veroilmoitus vaikka puolisot omistaisivat tilat erikseen."]
[null," - kaikilla tiloilla, joissa käyttömaksun maksajalla on omistusosuuksia"]
[]
[null,"Mette-ohjelma on tekijänoikeuksien alainen, eikä ole muutettavissa ilman lupaa."]
[null,"Kaikissa artikkelissa, jossa tätä työkirjaa esitetään tai lainataan, on mainittava alkuperäinen tiedoston lähde: www.metsavero.fi"]
[null,"Internet -linkityksessä on käytettävä hyperlinkin kohteena verkko-osoitetta metsavero.fi"]
[]
[null,"Ohjelmaan on lisätty ohjeita, jotka on merkitty pienellä punaisella kolmiolla"]
[null,"Ohje tulee näkyville viemällä hiiri merkityn solun päälle."]
[]
[null,"Muutokset edellisistä versioista:"]
[null,"16.10"]
[null,"Verolomake 2C on muutettu vastaamaan verottajan vahvistamaa 2016 vuoden lomakketta."]
[]
[null,"16.00"]
[null,"Verovuoden 2016 ensiversio. Tässä versiossa on vielä verovuoden 2015 2C-lomake. "]
[null,"Syksyllä verottajan julkaistua uuden 2C lomakkeen, Mettestä julkaistaan päivitys."]
[]
[null,"15.12"]
[null,"Hankintatyö 2 osiosta korjattu kaavavirhe solusta E9. Kaava laski virheellisesti maatilalle 2 maatilan 1 hakkuumäärän."]
[null,"Sähköiestä ilmoittamisesta poistettu rivit joilla saattoi ilmoittaa asianhoitajan ja ulkomaan nimen. Ko tietokohdat eivät ole enää 2015 käytössä."]
[]
[null,"15.11"]
[null,"Hankintatyön arvot 2015, matkakustannusten arvot, Maataloudessa käytetyn puun arvot."]
[null,"Työhuonevähennyksen arvon tarkistus."]
[]
[null,"15.10"]
[null,"Tässä versiossa on uusi 2C verolomake verovuodelle 2015"]
[null,"Alv-kausiveroilmoitukseen lisätty sähköisen siirtotiedoston tekemisen mahdollisuus."]
[]
[null,"15.00"]
[null,"Verovuoden 2015 ensiversio. Tässä versiossa on vielä verovuoden 2014 2C-lomake. "]
[null,"Syksyllä verottajan julkaistua uuden 2C lomakkeen, Mettestä lulkaistaan päivitys."]
[]
[null,"14.21"]
[null,"Metsävähennyksen laskentaan lisätty kohta, jossa käyttäjä voi määritellä käytettävän metsävähennyksen maksimivähennystä pienemmäksi."]
[null,"Pieniä kauneusvirheitä korjattu."]
[]
[null,"14.20"]
[null,"Sisältää 9.1.2015 verottajan julkaiseman yhtenäistämisohjeen sisältämät hankintatyön arvon, kilometrikorvaukset, maatalouden käyttöön otetun puun arvostuksen"]
[]
[null,"14.10"]
[null,"Sisältää 2014 vuoden 2C-lomakkeen"]
[null,"Päivämäärien automaattinen kelpoisuuden tarkastaminen poistettu."]
[]
[]
[null,"14.00"]
[null,"Verovuoden ensiversio. Sisältää vielä vanhan 2C-lomakkeen"]
[null,"Uinumaan jätetyn hankintatyön arvon laskentaa tarkennettu ja lisätty oma laskenta-alue."]
[null,"Ajopäiväkirjaan on lisätty traktorin tuntihinta"]
[null,"13.16"]
[null,"Hankintatyön uinumaan jäävän ja uinumassa olleen arvon laskenta korjattu. Lisätty sitä varten uusia taulukoita hankintatyön laskentojen välilehdille."]
[]
[null,"13.15"]
[null,"Menovarauksen laskennassa ilmennyt virhe korjattu. Koskee vain Pohjois-Suomen osaa, jos tuloutettavaa vuodelta 2007 sekä 2008. "]
[]
[null,"13.14"]
[null,"Sähköisen ilmoittamisen taulukkoon lisätty puuttuvat kaavat soluihin O67-O76."]
[]
[null,"13.13"]
[null,"Menot tauluun lisätty alv-% sarakkeeseen pudotusvalikko 24%, 10% ja 0% verokannoille."]
[null,"Käytetyn metsävähennyksen laskentaa korjattu, tilanteessa, jossa osa metsävähennystiloista luovutettu verovuoden aikana."]
[]
[null,"13.12"]
[null,"Lisätty hankintatyön ja konekustannusarvot. "]
[]
[null,"13.11"]
[null,"Tuhovarauksen siirtyminen oikein 2C-lomakkeelle korjattu."]
[]
[null,"13.10"]
[null,"Sisältää verottajan julkaiseman uuden 2C -verolomakkeen 2013."]
[]
[null,"13.00"]
[null,"Verovuoden ensiversio. Sisältää vielä vanhan 2C-lomakkeen"]
[null,"Meno- ja tuhovaraustaulukkoa muutettu selkeämmäksi ja automaattisemmaksi"]
[null,"Metsävähennystaulukossa tiloittainen erittely otetty uudelleen näkyville"]
[]
[]
[null,"12.11"]
[null,"Hankintatyön arvot muutettu 2012 arvoiksi ja laskentaan tehty korjaus, joka voi vaikuttaa yli 125 m3 hankintatyötä tehneillä."]
[null,"Metsävähennyksen osalta muutettu lomaketta selkeämmäksi. Vaikuttaa, jos metsävähennystila luovutettu ja metsävähennysmetsää jää vielä omistukseen."]
[null,"Kilometrikorvaukset 2012 verottajan yhtenäistämisohjeista (julkaistu 10.1.2013)"]
[]
[null,"12.10"]
[null,"Verovuoden 2012 2C-lomake"]
[null,"Tulot lomakkeelle lisätty poltto-ja joulupuiden hankintakaupan erottelu"]
[null,"Lisätty \"Hankintatyö 2\" -lomake poltto-ja joulupuiden hankintatyön erottelua varten"]
[null,"Muotoilumuutoksia"]
[]
[null,"12.01"]
[null,"Ajopäiväkirjassa ollut kaavavirhe korjattu."]
[]
[null,"12.00"]
[null,"Verovuoden ensiversio. Sisältää vieä vanhan 2C-lomakkeen"]
[null,"Kemera välilehti poistettu. "]
[null,"Hankintatyön laskentaan lisätty maatilakohtainen laskentamahdollisuus 5:lle maatilalle."]
[null,"Lisätty uinumaan jätetyn hankintatyön kirjausmahdollisuus."]
[]
[null,"11.12"]
[null,"Lisätty Yhtenäisätmisohjeen mukaiset hankintatyön hinnat ja km-korvausarvot."]
[]
[null,"11.11"]
[null,"Metsätalouden tuloslaskelmasta korjattu kaava solusta C21 ja tarkennettu kaavaa solussa C9"]
[]
[null,"11.10"]
[null,"Lisätty 2011 verolomake"]
[]
[null,"11.00"]
[null,"Verovuoden ensiversio, ei sisällä vielä 2011 verolomakkeita"]
[]
[null,"10.31"]
[null,"Korjattu kemera-oja- ja tiehankkeiden kohdalla ollut alv:n kirjautumisen virhe. "]
[]
[null,"10.30"]
[null,"Alv-lomake muutettu alv-kausiverolomakkeeksi"]
[]
[null,"10.20"]
[null," - Vuoden 2010 verolomake 2C ja sen vaatimat muutokset ohjelmaan"]
[]
[null,"10.10"]
[null," - Arvonlisäveromuutoksen 1.7. edellyttämät kaavamuutokset "]
[]
[null,"10.00"]
[null," - Vuoden 2010 ohjelman ensiversio. Ohjelmaan tulee päivitys verottajan julkaistessa syksyllä uuden 2C-lomakkeen"]
[null," - Ohjelman sisältämä verolomake 2C on vielä 2009 mallia"]
[null," - Ajopäiväkirjaan on lisätty kirjausrivejä"]
[null," - Kaikilla ohjelma-alustoilla käytetään samaa Mette versiota (Microsoft Excel ja Openoffice Calc Windows ja Mac käyttöjärjestelmät)"]
[null,"9.11"]
[null," - Tulokirjausrivejä lisätty"]
[null," - Konepoistoihin lisätty rivejä "]
[null," - Hankintatyön- ja kuljetuksen arvot 2009 täyttöohjeesta"]
[null," - Matkakulujen ja päivärahojen arvot 2009 täyttöohjeesta ja yhtenäistämisohjeesta"]
[null," - Kemerarahotteisten tie ja ojahankkeiden poistokirjausmenettelyä uudistettu metsänomistajan kannalta edullisemmaksi"]
[null," - Kemera-lomakkeelle muutoksia aiemmin verotuksessa vähennettyjen menojen kirjautumisessa"]
[]
[null,"9.10"]
[null," - Lisätty uusi 2C-lomake"]
[null," - Metsävähennysmenettelyn muutoksien vuoksi metsävähennyslomaketta on muutettu "]
[null," - Hankintatyö-lomakkeelle on lisätty puutavaralajeja"]
[null," - Lisätty de minimis tukien laskentataulukko"]
[null," - Kaavoja sisältävät solut suojattu lukitsemalla ne.  Lukituksen voi tarvittaessa purkaa poistamalla taulukon suojauksen. (Excel 2007 Tarkista - Poista taulukon suojaus,   Ei salasanaa)"]
[null," - Arvonlisäverovelvollisuus ilmoitetaan Etusivun tiedoissa, josta ohjelma tulkitsee sen tarvittaviin paikkoihin"]
[]
[null,"9.00"]
[null," - Vuoden 2009 ohjelman ensiversio. Ohjelmaan tulee päivitys verottajan julkaistessa syksyllä uuden 2C-lomakkeen"]
[null," - Ohjelman sisältämä verolomake 2C on vielä 2008 mallia"]
[null," - Lisätty tilojen erittely 18 tilaa varten"]
[]
[null,"8.23"]
[null," - Hankintatyön määrän ja arvon siirtyminen 2C-lomakkeelle korjattu"]
[null," - Korjattu virhe 2C-lomakkeella kohdassa käytetty metsävähennys yhteensä ja sähköisessä ilmoittamisessa."]
[]
[null,"8.22"]
[null," - Metsätalouden tukien kirjautuminen muutettu 2C-lomakkeella, sekä tulot välilehdellä"]
[null," - Ajopäiväkirjaan päivitetty yhtenäistämisohjeiden mukaiset matkakustannukset"]
[]
[null,"8.21"]
[null," - Pieni muutos 2C-lomakkeella ja Menot välilehdellä"]
[]
[null,"8.20"]
[null," - Verolain muutoksen vaatimat mittavat muutokset lähes koko ohjelmassa"]
[]
[null,"8.11"]
[null," - Korjattu alv virhe arvionvaraiset lomakkeella"]
[]
[null,"8.10"]
[null," - Korjattu Kemera-lomakkeella käsiteltävien monojen ja tukien kirjauksia. Kemera-hankkeiden menokirjaukset eivät summautunet oikein menoiksi. Tämä puute on korjattu. Lisäksi poistomenettelynä seurattavien kemera-hankkeiden osalta on muutettu toimintoa siten, että poistoihin tulee vain hankkeen menojen ja tuen erotus. Tukea ei kirjata enää ollenkaan tältä osin 2C-lomakkeelle. "]
[null," - Tulot välilehdelle on lisätty omasta metsästä otetun puutavaran määrän ja arvon laskenta."]
[null," - Menoihin on lisätty kirjausrivejä"]
[null," - Kirjanpitoon sisältyvien muun toiminnan menojen erittely lisätty menot  ja poistot tauluun"]
[null," - Ajopäiväkirjaa on uudistettu siten, että kilometrikorvaukset voidaan helposti laskea myös muille kuin autolle."]
[null," - Arvionvaraiset välilehti on palautettu käyttäjien toivomuksesta takaisin käyttöön"]
[null," - Etelä- ja Pohjois-Suomen versiot yhdistetty"]
[]
[null,"8.00"]
[null," - Vuoden 2008 ensiversio. Päivityksiä julkaistaan todennäköisesti ainakin syksyllä, kun verottaja ilmoittaa muutokset verotukseen."]
[null," - Hankintatyönarvon laskenta on eriytetty omaksi välilehdekseen."]
[null," 7.24"]
[null," - Kaavavirhe poistot taulussa korjattu"]
[]
[null," 7.23 "]
[null," - Metsätalouden menoihin sisältyvät muun tulonlähteen menot muutettu manuaaliseksi virheellisen käytön riskin välttämiseksi"]
[]
[null," 7.22"]
[null," - Ohjelma nimetty Mette metsätalouden kirjanpito-ohjelmaksi"]
[null," - 2C lomakkeen sähköinen tiedonsiirto verohallinnolle"]
[null," - kk alv"]
[null," - arvionvaraiset välilehti poistettu"]
[null," - menot tauluun ja kemera-tauluun on lisätty menorivejä"]
[null," - Lapin ja Oulun Lapin lääniläisille tehty oma versio, jossa varaukset 6 vuodeksi"]
[]
[]
[null," 7.01"]
[null," - 2C-lomakkeen kaavavirhe korjattu, joka koskee lapinläänissä asuvien meno- ja tuhovarauksien siirtymistä lomakkeelle."]
[]
[null,"7.00"]
[null," - Verovuoden muutos"]
[null," - lisätty arvionvaraisiin menoihin sähkökulut"]
[]
[null," 6.20"]
[null," - 2-lomake tehty uudelleen verottajan tekemien muutosten mukaiseksi"]
[null," - tulot-lomakkeelle tehty värikoodauksia selventämään taulukkoa"]
[null,"6.12."]
[null," - Kameraosasta korjattu kaavavirheitä ja lisätty ohjetekstejä."]
[null," - Menot taulukon solusta D77 on muutettu kommenttitekstiä"]
[null,"6.11."]
[null," - Poistoina seurattavien kemera-hankkeiden seuranta automatisoitu."]
[null," - Poistettu alv-kaava kemera-hankkeen koostetuontiriviltä tulot taulukosta."]
[null," - Yksi kaavavirhe korjattu kemera-taulukosta solu (D36)."]
[null," 6.10"]
[null," - Lisätty poistojen automatisoitu hyödykekohtainen seuranta."]
[null," - Muutettu muotoiluja omistan nimen ja tilan nimen osalta taulukoissa."]
[null," - Lisätty Kemera-hankkeiden seuranta. Jos menot kemera-avustuksia isommat, tulee avustukset ja menot näkyviin."]
[null," - Lisätty menokirjanpitoon Muut menot sarakkeita. Ovat piilossa voi ottaa tarvittaessa esiin näytä toiminnalla, ja nimetä haluamakseen."]
[null," - Luovutuksen kohteita on lisätty kahdesta neljään."]
[null," - Metsävähennys automatisoitu. Seurattavia tiloja valmiina 6 kpl."]
[null," 6.00"]
[null," - Lisätty Velat taulukko "]
[null," - Vuoden 2006 versio, joka päivitetään tarvittaessa syksyllä uuden tiedoston ja makron avulla. Käyttömaksu kattaa verovuoden 2006 päivitykset."]
[null," 5.00"]
[null," - Lisätty tulostuskelpoinen ALV-lomake, 2C lomake on muutettu vastaamaan vuoden 2005 muotoilua (vuosiluvut) (ver 5.00)"]
[null," - Käyttömaksu lisätty."]
[null," - Työkirjanoikeudet omistaa Forwood. Muutoksia vain tiedotesivulla (ver 4.02)"]
[null," - Pieniä kaavakorjauksia esim. arvionvaraiset taulussa kaava ei ollut huomioinut %-määrän muutosta (ver 4.01)"]
[null," - 2C lomake on muutettu vastaamaan vuoden 2004 muotoilua (vuosiluvut) (ver 4.00)"]
[null," - Ajopäiväkirjaan on lisätty päivärahan kirjauspaikka (ver 3.57)"]
[null," - 2C lomake on muutettu vastaamaan uutta muotoilua ja se voidaan tulostaa veroilmoitukseksi"]
[null," - Lomakkeen muuttumisesta johtuen tulot taulukkoon on tehty vastaavat muutokset em. kohtien erittelyä varten"]
[null," - Metsävähennyksen laskentataulukossa korjattu kaavavirhe kohdasta 28. (ver.3.51)"]
[null," - Varaukset taulun solussa C13 olevan kaavan virhe korjattu (ver.3.52)"]
[null," - 2C-lomakkeen eräitä soluja on yhdistetty, jotta pitkät luvut mahtuvat niihin. (ver.3.53)"]
[null," - 2c-Lomakkeen solujen muotoilua on korjattu. Eräisiin soluihin luvut tallentuivat päivämääränä. (ver. 3.54)"]
[null," - Ajopäiväkirjaan on muutettu kilometrikustannukseksi verottajan suositus 0,21 eur/km oletukseksi (ver. 3.54)"]
[null," - korjattu virhe 2C-lomakkeen kohdassa 18. Tila 3 koskeva kaavavirhe korjattu (ver 3.55)"]
[null," - korjattu virhe Metsätalouden tulos taulussa kohta tulot (ver 3.55)"]
[null," - 2c-Lomakkeen solujen muotoilua on vielä korjattu. Eräisiin soluihin luvut tallentuivat vielä päivämääränä. (ver. 3.56)"]
[null," - Metsävähennystaulukossa hankintakaupan pääomatuloksi muodostui arvo, josta ei ollut vähennetty hankintatyön arvoa. Virhe on korjattu versiossa 3.57"]
[]
[]
[null," - 2C-lomakkeen eräitä soluja on yhdistetty, jotta pitkät luvut mahtuvat niihin. (ver.3.53)"]
[null," - 2c-Lomakkeen solujen muotoilua on korjattu. Eräisiin soluihin luvut tallentuivat päivämääränä. (ver. 3.54)"]
[null," - Ajopäiväkirjaan on muutettu kilometrikustannukseksi verottajan suositus 0,21 eur/km oletukseksi (ver. 3.54)"]
[null," - korjattu virhe 2C-lomakkeen kohdassa 18. Tila 3 koskeva kaavavirhe korjattu (ver 3.55)"]
[null," - korjattu virhe Metsätalouden tulos taulussa kohta tulot (ver 3.55)"]
[null," - 2c-Lomakkeen solujen muotoilua on vielä korjattu. Eräisiin soluihin luvut tallentuivat vielä päivämääränä. (ver. 3.56)"]
[null," - Metsävähennystaulukossa hankintakaupan pääomatuloksi muodostui arvo, josta ei ollut vähennetty hankintatyön arvoa. Virhe on korjattu versiossa 3.57"]

{"sheet":"Etusivu","index":1,"n_rows":35,"n_cols":9,"rows_kept":35,"cut":false,"hidden":false,"merged":[[12,8,20,11],[19,4,31,6],[9,8,11,11]]}
[]
[]
[null,"Mette 2016","MAKSUTON RAJOITETTU TESTIVERSIO"]
[null,"Mette 16.10 Forwood"]
[]
[null,"METSÄTALOUDEN KIRJANPITO"]
[null,2016,null,null,"Metsätilat "]
[null,null,null,null,"Nimet päivittyvät metsävähennyksen laskentaan tästä"]
[null,"Verovuosi",2016]
[null,"Omistaja","RAJOITETTU TESTIVESIO",1,"Testitila 1:45",10,null,null,"Metten taulukot on suojattu vahingossa tapahtuvalta kaavojen muuttamiselta. Tarvittaessa suojauksen saa poistettua. Salasanaa ei tarvita."]
[null,"Osoite","Osoite",2,null,11]
[null,"Postinumero","38210",3,null,11]
[null,"Postitoimipaikka","Sastamala","4",null,13,null,null,"Suojauksen poistaminen eri ohjelmistoissa:\nExcel 2016, 365, 2013, 2010 ja 2007\nTarkista - Poista taulukon suojaus.\nExcel 2000-2003 ja Mac Excel 2008\nTyökalut - Suojaus - Poista taulukon suojaus\nLibreOffice/OpenOffice Calk 5.0, 4.2, 4.1, 3.3, 3.2 ja 3.1 (Windows ja Mac)\nTyökalut - Suojaa asiakirja - Taulukko . "]
[null,"Henkilö- tai Y-tunnus","1322222-2","5",null,14]
[null,null,null,"6",null,15]
[null,null,null,"7",null,16]
[null,"Täydentäviä tietoja",null,"8",null,17]
[null,"Tietoja tarvitaan mm. sähköisessä ilmoittamisessa",null,"9",null,18]
[]
[null,"Arvonlisäverovelvollinen","Kyllä",{"$f":"IF(C20=\"ei\",\"\",IF(C20=\"kyllä\",\"\",\"<- tarkista\"))","v":""},"Jos tarvitset apua ohjelman käytössä, voimme  auttaa sinua myös TeamViewer etähallintaohjelmalla. Otamme yhteyden koneeseesi ja autamme ongelman löytämisessä ja korjaamisessa.\n\n\nSoita meille ja kerro ongelmasta. Otamme sinun koneellesi etäyhteyden heti tai jos emme ole juuri silloin koneella, sovimme ajan jolloin etäyhteys otetaan. \n\nVoit asentaa TeamViewerin Metteyhteyden vieressä olevasta linkistä, jos sinulla ei ole ennestään TeamViewer etäyhteysohjelmaa. Jos sinulla on jo ohjelma, voit kyttää omaa ohjelmaasi.\n\nYhteydenotot:\n050-5051969 tai info@metsavero.fi. "]
[null,"Kausi-ilmoituksen jaksot","kerran vuodessa",{"$f":"IF(C21=\"kerran vuodessa\",\"\",IF(C21=\"4 kertaa vuodessa\",\"\",IF(C21=\"kuukausittain\",\"\",\"<- tarkista\")))","v":""},null,null,null,{"$f":"IF(C21=\"kerran vuodessa\",\"V\",IF(C21=\"4 kertaa vuodessa\",\"Q\",IF(C21=\"kuukausittain\",\"K\",\"\")))","v":"V"}]
[null,"Kotikunta 31.12.2015","Kunta"]
[null,"Verotusyhtymä","ei",{"$f":"IF(C23=\"ei\",\"\",IF(C23=\"kyllä\",\"\",\"<- tarkista\"))","v":""}]
[null,"Tilan omistus:     Verovelvollinen, %",1,{"$f":"IF(C23=\"kyllä\",\"\",IF(C24+C25<1,\"<- tarkista\",IF(C24+C25>1,\"<- tarkista\",IF(C24+C25=1,\"\",IF(C23=\"kyllä\",\"-\",)))))","v":""}]
[null,"                            Puoliso, %"]
[null,null,null,null,null,null,null,null,"Etätuki"]
[null,"Veroilmoituksen viimeinen \njättöpäivä","28022017"]
[null,"Veroilmoituksen allekirjoituspäivä\nmuodossa PPKKVVVV","28022017"]
[null,"Veroilmoitusta täydentäviä tietoja antavan nimi","Nimi"]
[null,"Veroilmoitusta täydentävien tietojen antajan sähköpostiosoite","Sähköpostiosoite"]
[null,"Veroilmoitusta täydentäviä tietoja antavan puhelinnumero","Puhelinnumero"]
[null,"Ilmoituksen allekirjoittajan nimi","Allekirjoittaja"]
[]
[null,null,"© Forwood"]
[null,null,"www.metsavero.fi"]

{"sheet":"Tulot","index":2,"n_rows":201,"n_cols":47,"rows_kept":201,"cut":false,"hidden":false,"merged":[[8,19,8,20],[3,1,3,2],[3,15,5,15],[3,10,3,11],[2,10,2,11],[3,5,3,7],[2,5,2,6],[2,0,2,2],[168,4,168,6],[169,1,170,2],[0,0,0,3],[1,5,1,6],[168,7,168,9],[169,3,170,3],[187,1,187,2],[186,1,186,2],[194,1,194,2],[195,1,195,2],[184,1,184,2],[171,1,171,2],[183,1,183,2],[185,1,185,2],[172,1,172,2],[173,1,173,2],[180,1,180,2],[175,1,175,2],[177,1,177,2],[178,1,178,2],[176,1,176,2],[174,1,174,2],[179,1,179,2],[181,1,181,2],[182,1,182,2],[200,1,200,2],[197,1,197,2],[190,1,190,2],[191,1,191,2],[188,1,188,2],[199,1,199,2],[193,1,193,2],[189,1,189,2],[192,1,192,2],[196,1,196,2],[198,1,198,2]]}
["Mette 2016"]
["Metsätalouden kirjanpito",null,null,null,null,{"$f":"Etusivu!C10","v":"RAJOITETTU TESTIVESIO"}]
["Tulot\nja omasta metsästä otettu puutavara alla",null,null,"Y-tunnus ",{"$f":"Etusivu!C14","v":"1322222-2"},{"$f":"Etusivu!E10","v":"Testitila 1:45"},null,null,null,null,{"$f":"IF(Etusivu!$C$20=\"kyllä\",\"Arvonlisäverovelvollinen\",\"Ei arvonlisäverovelvollinen\")","v":"Arvonlisäverovelvollinen"}]
["Kuitti","päiväys",null,null,null,"Puunmyyntitulot, alv 0%",null,null,"Hankintatyö","Metsävähen-","ALV",null,"Ennakon- ","Vakuutus","Hirvi-","Metsä-\ntal. tuet (verolliset)","Kemera-","Muut",null,null,null,null,null,null,null,null,"Aputaulukko hankintatyötulon siirtämiseksi hankintatyön (1) laskentaan. Normaali hankintatyö 1.2.",null,null,null,null,null,null,null,null,null,null,"Aputaulukko hankintatyötulon siirtämiseksi hankintatyön (2) laskentaan. Poltto- ja joulupuiden hankintatyö 1.3."]
[null,null,null,null,null,"Pystykaupat","Hankinta-","Poltto- ja","maatila","nys oikeus",null,null,"pidätykset","korvaukset","vahinko",null,"tukien ","tulot (alv 0%)"]
["N:o","pv","kk"," Selite ja kaupanteko päivä ja vuosi",null,null,"kaupat","joulupuukaupat","numero (1-5)","on (1) / ei (0)","%","eur",null,null,"korvaukset",null,"tuloutus",null,null,null,null,"Valikoiden arvoja",null,null,null,null,"T1M0","T1M1","T2M0","T2M1","T3M0","T3M1","T4M0","T4M1","T5M0","T5M1",null,"T1M0","T1M1","T2M0","T2M1","T3M0","T3M1","T4M0","T4M1","T5M0","T5M1"]
["YHTEENSÄ",null,null,null,null,{"$f":"SUM(F9:F163)","v":56600},{"$f":"SUM(G9:G163)","v":3450},{"$f":"SUM(H9:H163)","v":0},null,null,null,{"$f":"SUM(L9:L164)","v":14412},11803,1230,0,440,{"$error":"#REF!"},0,null,null,null,null,null,null,null,null,{"$f":"SUM(AA9:AA164)","v":0},3450,0,0,0,0,0,0,0,0,null,{"$f":"SUM(AL9:AL164)","v":0},0,0,0,0,0,0,0,0,0]
["OHJE",null,null,null,null,"Puunmyyntitulot yhteensä",null,{"$f":"SUM(F7:H7)","v":60050}]
[100,1,6,"Puukauppa PUUFIRMA oy",null,56600,null,null,1,1,{"$f":"IF(Etusivu!$C$20=\"kyllä\",24%,0%)","v":0.24},{"$f":"IF(R9>0,R9*K9,F9*K9+G9*K9+H9*K9)","v":13584},11320,null,null,null,null,null,null,"Apulaskuri: alv:t pois",null,1,0,1,1,null,{"$f":"IF($I9=1,IF($J9=0,$G9,0),0)","v":0},{"$f":"IF($I9=1,IF($J9=1,$G9,0),0)","v":0},{"$f":"IF($I9=2,IF($J9=0,$G9,0),0)","v":0},{"$f":"IF($I9=2,IF($J9=1,$G9,0),0)","v":0},{"$f":"IF($I9=3,IF($J9=0,$G9,0),0)","v":0},{"$f":"IF($I9=3,IF($J9=1,$G9,0),0)","v":0},{"$f":"IF($I9=4,IF($J9=0,$G9,0),0)","v":0},{"$f":"IF($I9=4,IF($J9=1,$G9,0),0)","v":0},{"$f":"IF($I9=5,IF($J9=0,$G9,0),0)","v":0},{"$f":"IF($I9=5,IF($J9=1,$G9,0),0)","v":0},null,{"$f":"IF($I9=1,IF($J9=0,$H9,0),0)","v":0},{"$f":"IF($I9=1,IF($J9=1,$H9,0),0)","v":0},{"$f":"IF($I9=2,IF($J9=0,$H9,0),0)","v":0},{"$f":"IF($I9=2,IF($J9=1,$H9,0),0)","v":0},{"$f":"IF($I9=3,IF($J9=0,$H9,0),0)","v":0},{"$f":"IF($I9=3,IF($J9=1,$H9,0),0)","v":0},{"$f":"IF($I9=4,IF($J9=0,$H9,0),0)","v":0},{"$f":"IF($I9=4,IF($J9=1,$H9,0),0)","v":0},{"$f":"IF($I9=5,IF($J9=0,$H9,0),0)","v":0},{"$f":"IF($I9=5,IF($J9=1,$H9,0),0)","v":0}]
[{"$f":"A9+1","v":101},null,null,"Ylin rivi on auki testailua varten",null,null,null,null,1,0,{"$f":"IF(Etusivu!$C$20=\"kyllä\",24%,0%)","v":0.24},0,null,null,null,null,null,null,null,"ALV %",0.24,2,1,2,2,null,0,0,0,0,0,0,0,0,0,0,null,{"$f":"IF($I10=1,IF($J10=0,$H10,0),0)","v":0},{"$f":"IF($I10=1,IF($J10=1,$H10,0),0)","v":0},{"$f":"IF($I10=2,IF($J10=0,$H10,0),0)","v":0},{"$f":"IF($I10=2,IF($J10=1,$H10,0),0)","v":0},{"$f":"IF($I10=3,IF($J10=0,$H10,0),0)","v":0},{"$f":"IF($I10=3,IF($J10=1,$H10,0),0)","v":0},{"$f":"IF($I10=4,IF($J10=0,$H10,0),0)","v":0},{"$f":"IF($I10=4,IF($J10=1,$H10,0),0)","v":0},{"$f":"IF($I10=5,IF($J10=0,$H10,0),0)","v":0},{"$f":"IF($I10=5,IF($J10=1,$H10,0),0)","v":0}]
[102,null,null,null,null,null,null,null,1,0,{"$f":"IF(Etusivu!$C$20=\"kyllä\",24%,0%)","v":0.24},0,null,null,null,null,null,null,null,"Summa ","Summa",3,null,3,3,null,0,0,0,0,0,0,0,0,0,0,null,0,0,0,0,0,0,0,0,0,0]
[103,2,7,"Kemeratuki",null,null,null,null,1,0,{"$f":"IF(Etusivu!$C$20=\"kyllä\",24%,0%)","v":0.24},0,null,null,null,440,null,null,null,{"$f":"CONCATENATE(\"Alv \",(U10*100),\" %\")","v":"Alv 24 %"},"alv 0%",4,null,4,4,null,0,0,0,0,0,0,0,0,0,0,null,0,0,0,0,0,0,0,0,0,0]
[104,3,8,"Vakuutuskorvaus myrskytuhosta, Pohjola",null,null,null,null,1,0,{"$f":"IF(Etusivu!$C$20=\"kyllä\",24%,0%)","v":0.24},0,null,1230,null,null,null,null,null,100,{"$f":"T13/(1+U10)","v":80.650000000000006},5,null,5,5,null,0,0,0,0,0,0,0,0,0,0,null,0,0,0,0,0,0,0,0,0,0]
[105,6,11,"Hankintakauppa, Puufirma oy",null,null,3450,null,1,1,{"$f":"IF(Etusivu!$C$20=\"kyllä\",24%,0%)","v":0.24},828,483,null,null,null,null,null,null,null,null,null,null,6,6,null,0,3450,0,0,0,0,0,0,0,0,null,0,0,0,0,0,0,0,0,0,0]
[106,null,null,null,null,null,null,null,1,0,{"$f":"IF(Etusivu!$C$20=\"kyllä\",24%,0%)","v":0.24},0,null,null,null,null,null,null,null,null,null,null,null,7,7,null,0,0,0,0,0,0,0,0,0,0,null,0,0,0,0,0,0,0,0,0,0]
[107,null,null,null,null,null,null,null,1,0,{"$f":"IF(Etusivu!$C$20=\"kyllä\",24%,0%)","v":0.24},0,null,null,null,null,null,null,null,null,null,null,null,8,8,null,0,0,0,0,0,0,0,0,0,0,null,0,0,0,0,0,0,0,0,0,0]
[{"$f":"A16+1","v":108},null,null,null,null,null,null,null,1,0,{"$f":"IF(Etusivu!$C$20=\"kyllä\",24%,0%)","v":0.24},0,null,null,null,null,null,null,null,null,null,null,null,9,9,null,0,0,0,0,0,0,0,0,0,0,null,0,0,0,0,0,0,0,0,0,0]
[109,null,null,null,null,null,null,null,1,0,{"$f":"IF(Etusivu!$C$20=\"kyllä\",24%,0%)","v":0.24},0,null,null,null,null,null,null,null,null,null,null,null,10,10,null,0,0,0,0,0,0,0,0,0,0,null,0,0,0,0,0,0,0,0,0,0]
[110,null,null,null,null,null,null,null,1,0,{"$f":"IF(Etusivu!$C$20=\"kyllä\",24%,0%)","v":0.24},0,null,null,null,null,null,null,null,null,null,null,null,11,11,null,0,0,0,0,0,0,0,0,0,0,null,0,0,0,0,0,0,0,0,0,0]
[111,null,null,null,null,null,null,null,1,0,{"$f":"IF(Etusivu!$C$20=\"kyllä\",24%,0%)","v":0.24},0,null,null,null,null,null,null,null,null,null,null,null,12,12,null,0,0,0,0,0,0,0,0,0,0,null,0,0,0,0,0,0,0,0,0,0]
[112,null,null,null,null,null,null,null,1,0,{"$f":"IF(Etusivu!$C$20=\"kyllä\",24%,0%)","v":0.24},0,null,null,null,null,null,null,null,null,null,null,null,13,null,null,0,0,0,0,0,0,0,0,0,0,null,0,0,0,0,0,0,0,0,0,0]
[113,null,null,null,null,null,null,null,1,0,{"$f":"IF(Etusivu!$C$20=\"kyllä\",24%,0%)","v":0.24},0,null,null,null,null,null,null,null,null,null,null,null,14,null,null,0,0,0,0,0,0,0,0,0,0,null,0,0,0,0,0,0,0,0,0,0]
[114,null,null,null,null,null,null,null,1,0,{"$f":"IF(Etusivu!$C$20=\"kyllä\",24%,0%)","v":0.24},0,null,null,null,null,null,null,null,null,null,null,null,15,null,null,0,0,0,0,0,0,0,0,0,0,null,0,0,0,0,0,0,0,0,0,0]
[115,null,null,null,null,null,null,null,1,0,{"$f":"IF(Etusivu!$C$20=\"kyllä\",24%,0%)","v":0.24},0,null,null,null,null,null,null,null,null,null,null,null,16,null,null,0,0,0,0,0,0,0,0,0,0,null,0,0,0,0,0,0,0,0,0,0]
[116,null,null,null,null,null,null,null,1,0,{"$f":"IF(Etusivu!$C$20=\"kyllä\",24%,0%)","v":0.24},0,null,null,null,null,null,null,null,null,null,null,null,17,null,null,0,0,0,0,0,0,0,0,0,0,null,0,0,0,0,0,0,0,0,0,0]
[117,null,null,null,null,null,null,null,1,0,{"$f":"IF(Etusivu!$C$20=\"kyllä\",24%,0%)","v":0.24},0,null,null,null,null,null,null,null,null,null,null,null,18,null,null,0,0,0,0,0,0,0,0,0,0,null,0,0,0,0,0,0,0,0,0,0]
[118,null,null,null,null,null,null,null,1,0,{"$f":"IF(Etusivu!$C$20=\"kyllä\",24%,0%)","v":0.24},0,null,null,null,null,null,null,null,null,null,null,null,19,null,null,0,0,0,0,0,0,0,0,0,0,null,0,0,0,0,0,0,0,0,0,0]
[119,null,null,null,null,null,null,null,1,0,{"$f":"IF(Etusivu!$C$20=\"kyllä\",24%,0%)","v":0.24},0,null,null,null,null,null,null,null,null,null,null,null,20,null,null,0,0,0,0,0,0,0,0,0,0,null,0,0,0,0,0,0,0,0,0,0]
[120,null,null,null,null,null,null,null,1,0,{"$f":"IF(Etusivu!$C$20=\"kyllä\",24%,0%)","v":0.24},0,null,null,null,null,null,null,null,null,null,null,null,21,null,null,0,0,0,0,0,0,0,0,0,0,null,0,0,0,0,0,0,0,0,0,0]
[121,null,null,null,null,null,null,null,1,0,{"$f":"IF(Etusivu!$C$20=\"kyllä\",24%,0%)","v":0.24},0,null,null,null,null,null,null,null,null,null,null,null,22,null,null,0,0,0,0,0,0,0,0,0,0,null,0,0,0,0,0,0,0,0,0,0]
[122,null,null,null,null,null,null,null,1,0,{"$f":"IF(Etusivu!$C$20=\"kyllä\",24%,0%)","v":0.24},0,null,null,null,null,null,null,null,null,null,null,null,23,null,null,0,0,0,0,0,0,0,0,0,0,null,0,0,0,0,0,0,0,0,0,0]
[123,null,null,null,null,null,null,null,1,0,{"$f":"IF(Etusivu!$C$20=\"kyllä\",24%,0%)","v":0.24},0,null,null,null,null,null,null,null,null,null,null,null,24,null,null,0,0,0,0,0,0,0,0,0,0,null,0,0,0,0,0,0,0,0,0,0]
[124,null,null,null,null,null,null,null,1,0,{"$f":"IF(Etusivu!$C$20=\"kyllä\",24%,0%)","v":0.24},0,null,null,null,null,null,null,null,null,null,null,null,25,null,null,0,0,0,0,0,0,0,0,0,0,null,0,0,0,0,0,0,0,0,0,0]
[125,null,null,null,null,null,null,null,1,0,{"$f":"IF(Etusivu!$C$20=\"kyllä\",24%,0%)","v":0.24},0,null,null,null,null,null,null,null,null,null,null,null,26,null,null,0,0,0,0,0,0,0,0,0,0,null,0,0,0,0,0,0,0,0,0,0]
[126,null,null,null,null,null,null,null,1,0,{"$f":"IF(Etusivu!$C$20=\"kyllä\",24%,0%)","v":0.24},0,null,null,null,null,null,null,null,null,null,null,null,27,null,null,0,0,0,0,0,0,0,0,0,0,null,0,0,0,0,0,0,0,0,0,0]
[127,null,null,null,null,null,null,null,1,0,{"$f":"IF(Etusivu!$C$20=\"kyllä\",24%,0%)","v":0.24},0,null,null,null,null,null,null,null,null,null,null,null,28,null,null,0,0,0,0,0,0,0,0,0,0,null,0,0,0,0,0,0,0,0,0,0]
[128,null,null,null,null,null,null,null,1,0,{"$f":"IF(Etusivu!$C$20=\"kyllä\",24%,0%)","v":0.24},0,null,null,null,null,null,null,null,null,null,null,null,29,null,null,0,0,0,0,0,0,0,0,0,0,null,0,0,0,0,0,0,0,0,0,0]
[129,null,null,null,null,null,null,null,1,0,{"$f":"IF(Etusivu!$C$20=\"kyllä\",24%,0%)","v":0.24},0,null,null,null,null,null,null,null,null,null,null,null,30,null,null,0,0,0,0,0,0,0,0,0,0,null,0,0,0,0,0,0,0,0,0,0]
[130,null,null,null,null,null,null,null,1,0,{"$f":"IF(Etusivu!$C$20=\"kyllä\",24%,0%)","v":0.24},0,null,null,null,null,null,null,null,null,null,null,null,31,null,null,0,0,0,0,0,0,0,0,0,0,null,0,0,0,0,0,0,0,0,0,0]
[131,null,null,null,null,null,null,null,1,0,{"$f":"IF(Etusivu!$C$20=\"kyllä\",24%,0%)","v":0.24},0,null,null,null,null,null,null,null,null,null,null,null,null,null,null,0,0,0,0,0,0,0,0,0,0,null,0,0,0,0,0,0,0,0,0,0]
[132,null,null,null,null,null,null,null,1,0,{"$f":"IF(Etusivu!$C$20=\"kyllä\",24%,0%)","v":0.24},0,null,null,null,null,null,null,null,null,null,null,null,null,null,null,{"$f":"IF($I41=1,IF($J41=0,$G41,0),0)","v":0},{"$f":"IF($I41=1,IF($J41=1,$G41,0),0)","v":0},{"$f":"IF($I41=2,IF($J41=0,$G41,0),0)","v":0},{"$f":"IF($I41=2,IF($J41=1,$G41,0),0)","v":0},{"$f":"IF($I41=3,IF($J41=0,$G41,0),0)","v":0},{"$f":"IF($I41=3,IF($J41=1,$G41,0),0)","v":0},{"$f":"IF($I41=4,IF($J41=0,$G41,0),0)","v":0},{"$f":"IF($I41=4,IF($J41=1,$G41,0),0)","v":0},{"$f":"IF($I41=5,IF($J41=0,$G41,0),0)","v":0},{"$f":"IF($I41=5,IF($J41=1,$G41,0),0)","v":0},null,0,0,0,0,0,0,0,0,0,0]
[133,null,null,null,null,null,null,null,1,0,{"$f":"IF(Etusivu!$C$20=\"kyllä\",24%,0%)","v":0.24},0,null,null,null,null,null,null,null,null,null,null,null,null,null,null,0,0,0,0,0,0,0,0,0,0,null,0,0,0,0,0,0,0,0,0,0]
[134,null,null,null,null,null,null,null,1,0,{"$f":"IF(Etusivu!$C$20=\"kyllä\",24%,0%)","v":0.24},0,null,null,null,null,null,null,null,null,null,null,null,null,null,null,0,0,0,0,0,0,0,0,0,0,null,0,0,0,0,0,0,0,0,0,0]
[135,null,null,null,null,null,null,null,1,0,{"$f":"IF(Etusivu!$C$20=\"kyllä\",24%,0%)","v":0.24},0,null,null,null,null,null,null,null,null,null,null,null,null,null,null,0,0,0,0,0,0,0,0,0,0,null,0,0,0,0,0,0,0,0,0,0]
[136,null,null,null,null,null,null,null,1,0,{"$f":"IF(Etusivu!$C$20=\"kyllä\",24%,0%)","v":0.24},0,null,null,null,null,null,null,null,null,null,null,null,null,null,null,0,0,0,0,0,0,0,0,0,0,null,0,0,0,0,0,0,0,0,0,0]
[137,null,null,null,null,null,null,null,1,0,{"$f":"IF(Etusivu!$C$20=\"kyllä\",24%,0%)","v":0.24},0,null,null,null,null,null,null,null,null,null,null,null,null,null,null,0,0,0,0,0,0,0,0,0,0,null,0,0,0,0,0,0,0,0,0,0]
[138,null,null,null,null,null,null,null,1,0,{"$f":"IF(Etusivu!$C$20=\"kyllä\",24%,0%)","v":0.24},0,null,null,null,null,null,null,null,null,null,null,null,null,null,null,0,0,0,0,0,0,0,0,0,0,null,0,0,0,0,0,0,0,0,0,0]
[139,null,null,null,null,null,null,null,1,0,{"$f":"IF(Etusivu!$C$20=\"kyllä\",24%,0%)","v":0.24},0,null,null,null,null,null,null,null,null,null,null,null,null,null,null,0,0,0,0,0,0,0,0,0,0,null,0,0,0,0,0,0,0,0,0,0]
[140,null,null,null,null,null,null,null,1,0,{"$f":"IF(Etusivu!$C$20=\"kyllä\",24%,0%)","v":0.24},0,null,null,null,null,null,null,null,null,null,null,null,null,null,null,0,0,0,0,0,0,0,0,0,0,null,0,0,0,0,0,0,0,0,0,0]
[141,null,null,null,null,null,null,null,1,0,{"$f":"IF(Etusivu!$C$20=\"kyllä\",24%,0%)","v":0.24},0,null,null,null,null,null,null,null,null,null,null,null,null,null,null,0,0,0,0,0,0,0,0,0,0,null,0,0,0,0,0,0,0,0,0,0]
[142,null,null,null,null,null,null,null,1,0,{"$f":"IF(Etusivu!$C$20=\"kyllä\",24%,0%)","v":0.24},0,null,null,null,null,null,null,null,null,null,null,null,null,null,null,0,0,0,0,0,0,0,0,0,0,null,0,0,0,0,0,0,0,0,0,0]
[143,null,null,null,null,null,null,null,1,0,{"$f":"IF(Etusivu!$C$20=\"kyllä\",24%,0%)","v":0.24},0,null,null,null,null,null,null,null,null,null,null,null,null,null,null,0,0,0,0,0,0,0,0,0,0,null,0,0,0,0,0,0,0,0,0,0]
[144,null,null,null,null,null,null,null,1,0,{"$f":"IF(Etusivu!$C$20=\"kyllä\",24%,0%)","v":0.24},0,null,null,null,null,null,null,null,null,null,null,null,null,null,null,0,0,0,0,0,0,0,0,0,0,null,0,0,0,0,0,0,0,0,0,0]
[145,null,null,null,null,null,null,null,1,0,{"$f":"IF(Etusivu!$C$20=\"kyllä\",24%,0%)","v":0.24},0,null,null,null,null,null,null,null,null,null,null,null,null,null,null,0,0,0,0,0,0,0,0,0,0,null,0,0,0,0,0,0,0,0,0,0]
[146,null,null,null,null,null,null,null,1,0,{"$f":"IF(Etusivu!$C$20=\"kyllä\",24%,0%)","v":0.24},0,null,null,null,null,null,null,null,null,null,null,null,null,null,null,0,0,0,0,0,0,0,0,0,0,null,0,0,0,0,0,0,0,0,0,0]
[147,null,null,null,null,null,null,null,1,0,{"$f":"IF(Etusivu!$C$20=\"kyllä\",24%,0%)","v":0.24},0,null,null,null,null,null,null,null,null,null,null,null,null,null,null,0,0,0,0,0,0,0,0,0,0,null,0,0,0,0,0,0,0,0,0,0]
[148,null,null,null,null,null,null,null,1,0,{"$f":"IF(Etusivu!$C$20=\"kyllä\",24%,0%)","v":0.24},0,null,null,null,null,null,null,null,null,null,null,null,null,null,null,0,0,0,0,0,0,0,0,0,0,null,0,0,0,0,0,0,0,0,0,0]
[149,null,null,null,null,null,null,null,1,0,{"$f":"IF(Etusivu!$C$20=\"kyllä\",24%,0%)","v":0.24},0,null,null,null,null,null,null,null,null,null,null,null,null,null,null,0,0,0,0,0,0,0,0,0,0,null,0,0,0,0,0,0,0,0,0,0]
[150,null,null,null,null,null,null,null,1,0,{"$f":"IF(Etusivu!$C$20=\"kyllä\",24%,0%)","v":0.24},0,null,null,null,null,null,null,null,null,null,null,null,null,null,null,0,0,0,0,0,0,0,0,0,0,null,0,0,0,0,0,0,0,0,0,0]
[151,null,null,null,null,null,null,null,1,0,{"$f":"IF(Etusivu!$C$20=\"kyllä\",24%,0%)","v":0.24},0,null,null,null,null,null,null,null,null,null,null,null,null,null,null,0,0,0,0,0,0,0,0,0,0,null,0,0,0,0,0,0,0,0,0,0]
[152,null,null,null,null,null,null,null,1,0,{"$f":"IF(Etusivu!$C$20=\"kyllä\",24%,0%)","v":0.24},0,null,null,null,null,null,null,null,null,null,null,null,null,null,null,0,0,0,0,0,0,0,0,0,0,null,0,0,0,0,0,0,0,0,0,0]
[153,null,null,null,null,null,null,null,1,0,{"$f":"IF(Etusivu!$C$20=\"kyllä\",24%,0%)","v":0.24},0,null,null,null,null,null,null,null,null,null,null,null,null,null,null,0,0,0,0,0,0,0,0,0,0,null,0,0,0,0,0,0,0,0,0,0]
[154,null,null,null,null,null,null,null,1,0,{"$f":"IF(Etusivu!$C$20=\"kyllä\",24%,0%)","v":0.24},0,null,null,null,null,null,null,null,null,null,null,null,null,null,null,0,0,0,0,0,0,0,0,0,0,null,0,0,0,0,0,0,0,0,0,0]
[155,null,null,null,null,null,null,null,1,0,{"$f":"IF(Etusivu!$C$20=\"kyllä\",24%,0%)","v":0.24},0,null,null,null,null,null,null,null,null,null,null,null,null,null,null,0,0,0,0,0,0,0,0,0,0,null,0,0,0,0,0,0,0,0,0,0]
[156,null,null,null,null,null,null,null,1,0,{"$f":"IF(Etusivu!$C$20=\"kyllä\",24%,0%)","v":0.24},0,null,null,null,null,null,null,null,null,null,null,null,null,null,null,0,0,0,0,0,0,0,0,0,0,null,0,0,0,0,0,0,0,0,0,0]
[157,null,null,null,null,null,null,null,1,0,{"$f":"IF(Etusivu!$C$20=\"kyllä\",24%,0%)","v":0.24},0,null,null,null,null,null,null,null,null,null,null,null,null,null,null,0,0,0,0,0,0,0,0,0,0,null,0,0,0,0,0,0,0,0,0,0]
[158,null,null,null,null,null,null,null,1,0,{"$f":"IF(Etusivu!$C$20=\"kyllä\",24%,0%)","v":0.24},0,null,null,null,null,null,null,null,null,null,null,null,null,null,null,0,0,0,0,0,0,0,0,0,0,null,0,0,0,0,0,0,0,0,0,0]
[159,null,null,null,null,null,null,null,1,0,{"$f":"IF(Etusivu!$C$20=\"kyllä\",24%,0%)","v":0.24},0,null,null,null,null,null,null,null,null,null,null,null,null,null,null,0,0,0,0,0,0,0,0,0,0,null,0,0,0,0,0,0,0,0,0,0]
[160,null,null,null,null,null,null,null,1,0,{"$f":"IF(Etusivu!$C$20=\"kyllä\",24%,0%)","v":0.24},0,null,null,null,null,null,null,null,null,null,null,null,null,null,null,0,0,0,0,0,0,0,0,0,0,null,0,0,0,0,0,0,0,0,0,0]
[161,null,null,null,null,null,null,null,1,0,{"$f":"IF(Etusivu!$C$20=\"kyllä\",24%,0%)","v":0.24},0,null,null,null,null,null,null,null,null,null,null,null,null,null,null,0,0,0,0,0,0,0,0,0,0,null,0,0,0,0,0,0,0,0,0,0]
[162,null,null,null,null,null,null,null,1,0,{"$f":"IF(Etusivu!$C$20=\"kyllä\",24%,0%)","v":0.24},0,null,null,null,null,null,null,null,null,null,null,null,null,null,null,0,0,0,0,0,0,0,0,0,0,null,0,0,0,0,0,0,0,0,0,0]
[163,null,null,null,null,null,null,null,1,0,{"$f":"IF(Etusivu!$C$20=\"kyllä\",24%,0%)","v":0.24},0,null,null,null,null,null,null,null,null,null,null,null,null,null,null,0,0,0,0,0,0,0,0,0,0,null,0,0,0,0,0,0,0,0,0,0]
[164,null,null,null,null,null,null,null,1,0,{"$f":"IF(Etusivu!$C$20=\"kyllä\",24%,0%)","v":0.24},0,null,null,null,null,null,null,null,null,null,null,null,null,null,null,0,0,0,0,0,0,0,0,0,0,null,0,0,0,0,0,0,0,0,0,0]
[165,null,null,null,null,null,null,null,1,0,{"$f":"IF(Etusivu!$C$20=\"kyllä\",24%,0%)","v":0.24},{"$f":"IF(R74>0,R74*K74,F74*K74+G74*K74+H74*K74)","v":0},null,null,null,null,null,null,null,null,null,null,null,null,null,null,0,0,0,0,0,0,0,0,0,0,null,{"$f":"IF($I74=1,IF($J74=0,$H74,0),0)","v":0},{"$f":"IF($I74=1,IF($J74=1,$H74,0),0)","v":0},{"$f":"IF($I74=2,IF($J74=0,$H74,0),0)","v":0},{"$f":"IF($I74=2,IF($J74=1,$H74,0),0)","v":0},{"$f":"IF($I74=3,IF($J74=0,$H74,0),0)","v":0},{"$f":"IF($I74=3,IF($J74=1,$H74,0),0)","v":0},{"$f":"IF($I74=4,IF($J74=0,$H74,0),0)","v":0},{"$f":"IF($I74=4,IF($J74=1,$H74,0),0)","v":0},{"$f":"IF($I74=5,IF($J74=0,$H74,0),0)","v":0},{"$f":"IF($I74=5,IF($J74=1,$H74,0),0)","v":0}]
[166,null,null,null,null,null,null,null,1,0,{"$f":"IF(Etusivu!$C$20=\"kyllä\",24%,0%)","v":0.24},0,null,null,null,null,null,null,null,null,null,null,null,null,null,null,0,0,0,0,0,0,0,0,0,0,null,{"$f":"IF($I75=1,IF($J75=0,$H75,0),0)","v":0},{"$f":"IF($I75=1,IF($J75=1,$H75,0),0)","v":0},{"$f":"IF($I75=2,IF($J75=0,$H75,0),0)","v":0},{"$f":"IF($I75=2,IF($J75=1,$H75,0),0)","v":0},{"$f":"IF($I75=3,IF($J75=0,$H75,0),0)","v":0},{"$f":"IF($I75=3,IF($J75=1,$H75,0),0)","v":0},{"$f":"IF($I75=4,IF($J75=0,$H75,0),0)","v":0},{"$f":"IF($I75=4,IF($J75=1,$H75,0),0)","v":0},{"$f":"IF($I75=5,IF($J75=0,$H75,0),0)","v":0},{"$f":"IF($I75=5,IF($J75=1,$H75,0),0)","v":0}]
[167,null,null,null,null,null,null,null,1,0,{"$f":"IF(Etusivu!$C$20=\"kyllä\",24%,0%)","v":0.24},0,null,null,null,null,null,null,null,null,null,null,null,null,null,null,0,0,0,0,0,0,0,0,0,0,null,{"$f":"IF($I76=1,IF($J76=0,$H76,0),0)","v":0},{"$f":"IF($I76=1,IF($J76=1,$H76,0),0)","v":0},{"$f":"IF($I76=2,IF($J76=0,$H76,0),0)","v":0},{"$f":"IF($I76=2,IF($J76=1,$H76,0),0)","v":0},{"$f":"IF($I76=3,IF($J76=0,$H76,0),0)","v":0},{"$f":"IF($I76=3,IF($J76=1,$H76,0),0)","v":0},{"$f":"IF($I76=4,IF($J76=0,$H76,0),0)","v":0},{"$f":"IF($I76=4,IF($J76=1,$H76,0),0)","v":0},{"$f":"IF($I76=5,IF($J76=0,$H76,0),0)","v":0},{"$f":"IF($I76=5,IF($J76=1,$H76,0),0)","v":0}]
[168,null,null,null,null,null,null,null,1,0,{"$f":"IF(Etusivu!$C$20=\"kyllä\",24%,0%)","v":0.24},0,null,null,null,null,null,null,null,null,null,null,null,null,null,null,0,0,0,0,0,0,0,0,0,0,null,{"$f":"IF($I77=1,IF($J77=0,$H77,0),0)","v":0},{"$f":"IF($I77=1,IF($J77=1,$H77,0),0)","v":0},{"$f":"IF($I77=2,IF($J77=0,$H77,0),0)","v":0},{"$f":"IF($I77=2,IF($J77=1,$H77,0),0)","v":0},{"$f":"IF($I77=3,IF($J77=0,$H77,0),0)","v":0},{"$f":"IF($I77=3,IF($J77=1,$H77,0),0)","v":0},{"$f":"IF($I77=4,IF($J77=0,$H77,0),0)","v":0},{"$f":"IF($I77=4,IF($J77=1,$H77,0),0)","v":0},{"$f":"IF($I77=5,IF($J77=0,$H77,0),0)","v":0},{"$f":"IF($I77=5,IF($J77=1,$H77,0),0)","v":0}]
[169,null,null,null,null,null,null,null,1,0,{"$f":"IF(Etusivu!$C$20=\"kyllä\",24%,0%)","v":0.24},0]
[170,null,null,null,null,null,null,null,1,0,{"$f":"IF(Etusivu!$C$20=\"kyllä\",24%,0%)","v":0.24},0]
[171,null,null,null,null,null,null,null,1,0,{"$f":"IF(Etusivu!$C$20=\"kyllä\",24%,0%)","v":0.24},0]
[{"$f":"A80+1","v":172},null,null,null,null,null,null,null,1,0,{"$f":"IF(Etusivu!$C$20=\"kyllä\",24%,0%)","v":0.24},0]
[173,null,null,null,null,null,null,null,1,0,{"$f":"IF(Etusivu!$C$20=\"kyllä\",24%,0%)","v":0.24},0]
[174,null,null,null,null,null,null,null,1,0,{"$f":"IF(Etusivu!$C$20=\"kyllä\",24%,0%)","v":0.24},0]
[175,null,null,null,null,null,null,null,1,0,{"$f":"IF(Etusivu!$C$20=\"kyllä\",24%,0%)","v":0.24},0]
[176,null,null,null,null,null,null,null,1,0,{"$f":"IF(Etusivu!$C$20=\"kyllä\",24%,0%)","v":0.24},0]
[177,null,null,null,null,null,null,null,1,0,{"$f":"IF(Etusivu!$C$20=\"kyllä\",24%,0%)","v":0.24},0]
[178,null,null,null,null,null,null,null,1,0,{"$f":"IF(Etusivu!$C$20=\"kyllä\",24%,0%)","v":0.24},0]
[179,null,null,null,null,null,null,null,1,0,{"$f":"IF(Etusivu!$C$20=\"kyllä\",24%,0%)","v":0.24},0]
[180,null,null,null,null,null,null,null,1,0,{"$f":"IF(Etusivu!$C$20=\"kyllä\",24%,0%)","v":0.24},0]
[181,null,null,null,null,null,null,null,1,0,{"$f":"IF(Etusivu!$C$20=\"kyllä\",24%,0%)","v":0.24},0]
[182,null,null,null,null,null,null,null,1,0,{"$f":"IF(Etusivu!$C$20=\"kyllä\",24%,0%)","v":0.24},0]
[183,null,null,null,null,null,null,null,1,0,{"$f":"IF(Etusivu!$C$20=\"kyllä\",24%,0%)","v":0.24},0]
[184,null,null,null,null,null,null,null,1,0,{"$f":"IF(Etusivu!$C$20=\"kyllä\",24%,0%)","v":0.24},0]
[185,null,null,null,null,null,null,null,1,0,{"$f":"IF(Etusivu!$C$20=\"kyllä\",24%,0%)","v":0.24},0]
[186,null,null,null,null,null,null,null,1,0,{"$f":"IF(Etusivu!$C$20=\"kyllä\",24%,0%)","v":0.24},0]
[187,null,null,null,null,null,null,null,1,0,{"$f":"IF(Etusivu!$C$20=\"kyllä\",24%,0%)","v":0.24},0]
[188,null,null,null,null,null,null,null,1,0,{"$f":"IF(Etusivu!$C$20=\"kyllä\",24%,0%)","v":0.24},0]
[189,null,null,null,null,null,null,null,1,0,{"$f":"IF(Etusivu!$C$20=\"kyllä\",24%,0%)","v":0.24},0]
[190,null,null,null,null,null,null,null,1,0,{"$f":"IF(Etusivu!$C$20=\"kyllä\",24%,0%)","v":0.24},0]
[191,null,null,null,null,null,null,null,1,0,{"$f":"IF(Etusivu!$C$20=\"kyllä\",24%,0%)","v":0.24},0]
[192,null,null,null,null,null,null,null,1,0,{"$f":"IF(Etusivu!$C$20=\"kyllä\",24%,0%)","v":0.24},0]
[193,null,null,null,null,null,null,null,1,0,{"$f":"IF(Etusivu!$C$20=\"kyllä\",24%,0%)","v":0.24},0]
[194,null,null,null,null,null,null,null,1,0,{"$f":"IF(Etusivu!$C$20=\"kyllä\",24%,0%)","v":0.24},0]
[195,null,null,null,null,null,null,null,1,0,{"$f":"IF(Etusivu!$C$20=\"kyllä\",24%,0%)","v":0.24},0]
[196,null,null,null,null,null,null,null,1,0,{"$f":"IF(Etusivu!$C$20=\"kyllä\",24%,0%)","v":0.24},0]
[197,null,null,null,null,null,null,null,1,0,{"$f":"IF(Etusivu!$C$20=\"kyllä\",24%,0%)","v":0.24},0]
[198,null,null,null,null,null,null,null,1,0,{"$f":"IF(Etusivu!$C$20=\"kyllä\",24%,0%)","v":0.24},0]
[199,null,null,null,null,null,null,null,1,0,{"$f":"IF(Etusivu!$C$20=\"kyllä\",24%,0%)","v":0.24},0]
[200,null,null,null,null,null,null,null,1,0,{"$f":"IF(Etusivu!$C$20=\"kyllä\",24%,0%)","v":0.24},0]
[201,null,null,null,null,null,null,null,1,0,{"$f":"IF(Etusivu!$C$20=\"kyllä\",24%,0%)","v":0.24},0]
[202,null,null,null,null,null,null,null,1,0,{"$f":"IF(Etusivu!$C$20=\"kyllä\",24%,0%)","v":0.24},0]
[203,null,null,null,null,null,null,null,1,0,{"$f":"IF(Etusivu!$C$20=\"kyllä\",24%,0%)","v":0.24},0]
[204,null,null,null,null,null,null,null,1,0,{"$f":"IF(Etusivu!$C$20=\"kyllä\",24%,0%)","v":0.24},{"$f":"IF(R113>0,R113*K113,F113*K113+G113*K113+H113*K113)","v":0}]
[205,null,null,null,null,null,null,null,1,0,{"$f":"IF(Etusivu!$C$20=\"kyllä\",24%,0%)","v":0.24},0]
[206,null,null,null,null,null,null,null,1,0,{"$f":"IF(Etusivu!$C$20=\"kyllä\",24%,0%)","v":0.24},0]
[207,null,null,null,null,null,null,null,1,0,{"$f":"IF(Etusivu!$C$20=\"kyllä\",24%,0%)","v":0.24},0]
[208,null,null,null,null,null,null,null,1,0,{"$f":"IF(Etusivu!$C$20=\"kyllä\",24%,0%)","v":0.24},0]
[209,null,null,null,null,null,null,null,1,0,{"$f":"IF(Etusivu!$C$20=\"kyllä\",24%,0%)","v":0.24},0]
[210,null,null,null,null,null,null,null,1,0,{"$f":"IF(Etusivu!$C$20=\"kyllä\",24%,0%)","v":0.24},0]
[211,null,null,null,null,null,null,null,1,0,{"$f":"IF(Etusivu!$C$20=\"kyllä\",24%,0%)","v":0.24},0]
[212,null,null,null,null,null,null,null,1,0,{"$f":"IF(Etusivu!$C$20=\"kyllä\",24%,0%)","v":0.24},0]
[213,null,null,null,null,null,null,null,1,0,{"$f":"IF(Etusivu!$C$20=\"kyllä\",24%,0%)","v":0.24},0]
[214,null,null,null,null,null,null,null,1,0,{"$f":"IF(Etusivu!$C$20=\"kyllä\",24%,0%)","v":0.24},0]
[215,null,null,null,null,null,null,null,1,0,{"$f":"IF(Etusivu!$C$20=\"kyllä\",24%,0%)","v":0.24},0]
[216,null,null,null,null,null,null,null,1,0,{"$f":"IF(Etusivu!$C$20=\"kyllä\",24%,0%)","v":0.24},0]
[217,null,null,null,null,null,null,null,1,0,{"$f":"IF(Etusivu!$C$20=\"kyllä\",24%,0%)","v":0.24},0]
[218,null,null,null,null,null,null,null,1,0,{"$f":"IF(Etusivu!$C$20=\"kyllä\",24%,0%)","v":0.24},0]
[219,null,null,null,null,null,null,null,1,0,{"$f":"IF(Etusivu!$C$20=\"kyllä\",24%,0%)","v":0.24},0]
[220,null,null,null,null,null,null,null,1,0,{"$f":"IF(Etusivu!$C$20=\"kyllä\",24%,0%)","v":0.24},0]
[221,null,null,null,null,null,null,null,1,0,{"$f":"IF(Etusivu!$C$20=\"kyllä\",24%,0%)","v":0.24},0]
[222,null,null,null,null,null,null,null,1,0,{"$f":"IF(Etusivu!$C$20=\"kyllä\",24%,0%)","v":0.24},0]
[223,null,null,null,null,null,null,null,1,0,{"$f":"IF(Etusivu!$C$20=\"kyllä\",24%,0%)","v":0.24},0]
[224,null,null,null,null,null,null,null,1,0,{"$f":"IF(Etusivu!$C$20=\"kyllä\",24%,0%)","v":0.24},0]
[225,null,null,null,null,null,null,null,1,0,{"$f":"IF(Etusivu!$C$20=\"kyllä\",24%,0%)","v":0.24},0]
[226,null,null,null,null,null,null,null,1,0,{"$f":"IF(Etusivu!$C$20=\"kyllä\",24%,0%)","v":0.24},0]
[227,null,null,null,null,null,null,null,1,0,{"$f":"IF(Etusivu!$C$20=\"kyllä\",24%,0%)","v":0.24},0]
[228,null,null,null,null,null,null,null,1,0,{"$f":"IF(Etusivu!$C$20=\"kyllä\",24%,0%)","v":0.24},0]
[229,null,null,null,null,null,null,null,1,0,{"$f":"IF(Etusivu!$C$20=\"kyllä\",24%,0%)","v":0.24},0]
[230,null,null,null,null,null,null,null,1,0,{"$f":"IF(Etusivu!$C$20=\"kyllä\",24%,0%)","v":0.24},0]
[231,null,null,null,null,null,null,null,1,0,{"$f":"IF(Etusivu!$C$20=\"kyllä\",24%,0%)","v":0.24},0]
[232,null,null,null,null,null,null,null,1,0,{"$f":"IF(Etusivu!$C$20=\"kyllä\",24%,0%)","v":0.24},0]
[233,null,null,null,null,null,null,null,1,0,{"$f":"IF(Etusivu!$C$20=\"kyllä\",24%,0%)","v":0.24},0]
[234,null,null,null,null,null,null,null,1,0,{"$f":"IF(Etusivu!$C$20=\"kyllä\",24%,0%)","v":0.24},0]
[235,null,null,null,null,null,null,null,1,0,{"$f":"IF(Etusivu!$C$20=\"kyllä\",24%,0%)","v":0.24},0]
[236,null,null,null,null,null,null,null,1,0,{"$f":"IF(Etusivu!$C$20=\"kyllä\",24%,0%)","v":0.24},0]
[237,null,null,null,null,null,null,null,1,0,{"$f":"IF(Etusivu!$C$20=\"kyllä\",24%,0%)","v":0.24},0]
[238,null,null,null,null,null,null,null,1,0,{"$f":"IF(Etusivu!$C$20=\"kyllä\",24%,0%)","v":0.24},0]
[239,null,null,null,null,null,null,null,1,0,{"$f":"IF(Etusivu!$C$20=\"kyllä\",24%,0%)","v":0.24},0]
[240,null,null,null,null,null,null,null,1,0,{"$f":"IF(Etusivu!$C$20=\"kyllä\",24%,0%)","v":0.24},0]
[241,null,null,null,null,null,null,null,1,0,{"$f":"IF(Etusivu!$C$20=\"kyllä\",24%,0%)","v":0.24},0]
[242,null,null,null,null,null,null,null,1,0,{"$f":"IF(Etusivu!$C$20=\"kyllä\",24%,0%)","v":0.24},0]
[243,null,null,null,null,null,null,null,1,0,{"$f":"IF(Etusivu!$C$20=\"kyllä\",24%,0%)","v":0.24},0]
[244,null,null,null,null,null,null,null,1,0,{"$f":"IF(Etusivu!$C$20=\"kyllä\",24%,0%)","v":0.24},0]
[245,null,null,null,null,null,null,null,1,0,{"$f":"IF(Etusivu!$C$20=\"kyllä\",24%,0%)","v":0.24},0]
[246,null,null,null,null,null,null,null,1,0,{"$f":"IF(Etusivu!$C$20=\"kyllä\",24%,0%)","v":0.24},0]
[247,null,null,null,null,null,null,null,1,0,{"$f":"IF(Etusivu!$C$20=\"kyllä\",24%,0%)","v":0.24},0]
[248,null,null,null,null,null,null,null,1,0,{"$f":"IF(Etusivu!$C$20=\"kyllä\",24%,0%)","v":0.24},0]
[249,null,null,null,null,null,null,null,1,0,{"$f":"IF(Etusivu!$C$20=\"kyllä\",24%,0%)","v":0.24},0]
[250,null,null,null,null,null,null,null,1,0,{"$f":"IF(Etusivu!$C$20=\"kyllä\",24%,0%)","v":0.24},0]
[251,null,null,null,null,null,null,null,1,0,{"$f":"IF(Etusivu!$C$20=\"kyllä\",24%,0%)","v":0.24},0]
[252,null,null,null,null,null,null,null,1,0,{"$f":"IF(Etusivu!$C$20=\"kyllä\",24%,0%)","v":0.24},0]
[253,null,null,null,null,null,null,null,1,0,{"$f":"IF(Etusivu!$C$20=\"kyllä\",24%,0%)","v":0.24},0]
[254,null,null,null,null,null,null,null,1,0,{"$f":"IF(Etusivu!$C$20=\"kyllä\",24%,0%)","v":0.24},{"$f":"IF(R163>0,R163*K163,F163*K163+G163*K163+H163*K163)","v":0},null,null,null,null,null,null,null,null,null,null,null,null,null,null,{"$f":"IF($I163=1,IF($J163=0,$G163,0),0)","v":0},{"$f":"IF($I163=1,IF($J163=1,$G163,0),0)","v":0},{"$f":"IF($I163=2,IF($J163=0,$G163,0),0)","v":0},{"$f":"IF($I163=2,IF($J163=1,$G163,0),0)","v":0},{"$f":"IF($I163=3,IF($J163=0,$G163,0),0)","v":0},{"$f":"IF($I163=3,IF($J163=1,$G163,0),0)","v":0},{"$f":"IF($I163=4,IF($J163=0,$G163,0),0)","v":0},{"$f":"IF($I163=4,IF($J163=1,$G163,0),0)","v":0},{"$f":"IF($I163=5,IF($J163=0,$G163,0),0)","v":0},{"$f":"IF($I163=5,IF($J163=1,$G163,0),0)","v":0},null,{"$f":"IF($I163=1,IF($J163=0,$H163,0),0)","v":0},{"$f":"IF($I163=1,IF($J163=1,$H163,0),0)","v":0},{"$f":"IF($I163=2,IF($J163=0,$H163,0),0)","v":0},{"$f":"IF($I163=2,IF($J163=1,$H163,0),0)","v":0},{"$f":"IF($I163=3,IF($J163=0,$H163,0),0)","v":0},{"$f":"IF($I163=3,IF($J163=1,$H163,0),0)","v":0},{"$f":"IF($I163=4,IF($J163=0,$H163,0),0)","v":0},{"$f":"IF($I163=4,IF($J163=1,$H163,0),0)","v":0},{"$f":"IF($I163=5,IF($J163=0,$H163,0),0)","v":0},{"$f":"IF($I163=5,IF($J163=1,$H163,0),0)","v":0}]
[255,null,null,null,null,null,null,null,1,0,{"$f":"IF(Etusivu!$C$20=\"kyllä\",24%,0%)","v":0.24},{"$f":"IF(R164>0,R164*K164,F164*K164+G164*K164+H164*K164)","v":0},null,null,null,null,{"$f":"#REF!","v":{"$error":"#REF!"}},null,null,null,null,null,null,null,null,null,{"$f":"IF($I164=1,IF($J164=0,$G164,0),0)","v":0},{"$f":"IF($I164=1,IF($J164=1,$G164,0),0)","v":0},{"$f":"IF($I164=2,IF($J164=0,$G164,0),0)","v":0},{"$f":"IF($I164=2,IF($J164=1,$G164,0),0)","v":0},{"$f":"IF($I164=3,IF($J164=0,$G164,0),0)","v":0},{"$f":"IF($I164=3,IF($J164=1,$G164,0),0)","v":0},{"$f":"IF($I164=4,IF($J164=0,$G164,0),0)","v":0},{"$f":"IF($I164=4,IF($J164=1,$G164,0),0)","v":0},{"$f":"IF($I164=5,IF($J164=0,$G164,0),0)","v":0},{"$f":"IF($I164=5,IF($J164=1,$G164,0),0)","v":0},null,{"$f":"IF($I164=1,IF($J164=0,$H164,0),0)","v":0},{"$f":"IF($I164=1,IF($J164=1,$H164,0),0)","v":0},{"$f":"IF($I164=2,IF($J164=0,$H164,0),0)","v":0},{"$f":"IF($I164=2,IF($J164=1,$H164,0),0)","v":0},{"$f":"IF($I164=3,IF($J164=0,$H164,0),0)","v":0},{"$f":"IF($I164=3,IF($J164=1,$H164,0),0)","v":0},{"$f":"IF($I164=4,IF($J164=0,$H164,0),0)","v":0},{"$f":"IF($I164=4,IF($J164=1,$H164,0),0)","v":0},{"$f":"IF($I164=5,IF($J164=0,$H164,0),0)","v":0},{"$f":"IF($I164=5,IF($J164=1,$H164,0),0)","v":0}]
["OHJE"]
[]
["Omasta metsästä otettu puutavara, "]
["Erittely"]
[null,null,null,null,"Tilat, joilla ei metsävähennysoikeutta",null,null,"Tilat, joilla on metsävähennysoikeus"]
["Määrä\nm3","Arvo\neur/m3",null,"KÄYTTÖKOHDE \n  Valitse käyttökohde luettelosta","3.1 maatalouskäyttö","3.2 elinkeinokäyttö","3.3 \nyksityiskäyttö","3.1 \nmaatalous-käyttö","3.2 \nelinkeino-\nkäyttö","3.3 \nyksityis-\nkäyttö"]
[{"$f":"SUM(A172:A201)","v":21},null,null,null,{"$f":"SUM(E172:E201)","v":0},0,0,0,0,315]
[21,15,null,"Yksityiskäyttö, metsävähennys",{"$f":"IF(D172=\"Maatalouskäyttö\",A172*B172,\"\")","v":""},{"$f":"IF(D172=\"Elinkeinokäyttö\",A172*B172,\"\")","v":""},{"$f":"IF($D172=\"Yksityiskäyttö\",$A172*$B172,\"\")","v":""},{"$f":"IF($D172=\"Maatalouskäyttö, metsävähennys\",$A172*$B172,\"\")","v":""},{"$f":"IF($D172=\"Elinkeinokäyttö, metsävähennys\",$A172*$B172,\"\")","v":""},{"$f":"IF($D172=\"Yksityiskäyttö, metsävähennys\",$A172*$B172,\"\")","v":315},"Maatalouskäyttö"]
[null,null,null,null,{"$f":"IF(D173=\"Maatalouskäyttö\",A173*B173,\"\")","v":""},{"$f":"IF(D173=\"Elinkeinokäyttö\",A173*B173,\"\")","v":""},{"$f":"IF($D173=\"Yksityiskäyttö\",$A173*$B173,\"\")","v":""},{"$f":"IF($D173=\"Maatalouskäyttö, metsävähennys\",$A173*$B173,\"\")","v":""},{"$f":"IF($D173=\"Elinkeinokäyttö, metsävähennys\",$A173*$B173,\"\")","v":""},{"$f":"IF($D173=\"Yksityiskäyttö, metsävähennys\",$A173*$B173,\"\")","v":""},"Elinkeinokäyttö"]
[null,null,null,null,{"$f":"IF(D174=\"Maatalouskäyttö\",A174*B174,\"\")","v":""},{"$f":"IF(D174=\"Elinkeinokäyttö\",A174*B174,\"\")","v":""},{"$f":"IF($D174=\"Yksityiskäyttö\",$A174*$B174,\"\")","v":""},{"$f":"IF($D174=\"Maatalouskäyttö, metsävähennys\",$A174*$B174,\"\")","v":""},{"$f":"IF($D174=\"Elinkeinokäyttö, metsävähennys\",$A174*$B174,\"\")","v":""},{"$f":"IF($D174=\"Yksityiskäyttö, metsävähennys\",$A174*$B174,\"\")","v":""},"Yksityiskäyttö"]
[null,null,null,null,"","","","","","","Maatalouskäyttö, metsävähennys"]
[null,null,null,null,"","","","","","","Elinkeinokäyttö, metsävähennys"]
[null,null,null,null,"","","","","","","Yksityiskäyttö, metsävähennys"]
[null,null,null,null,"","","","","",""]
[null,null,null,null,"","","","","",""]
[null,null,null,null,"","","","","",""]
[null,null,null,null,"","","","","",""]
[null,null,null,null,"","","","","",""]
[null,null,null,null,"","","","","",""]
[null,null,null,null,"","","","","",""]
[null,null,null,null,"","","","","",""]
[null,null,null,null,"","","","","",""]
[null,null,null,null,"","","","","",""]
[null,null,null,null,"","","","","",""]
[null,null,null,null,"","","","","",""]
[null,null,null,null,"","","","","",""]
[null,null,null,null,"","","","","",""]
[null,null,null,null,"","","","","",""]
[null,null,null,null,"","","","","",""]
[null,null,null,null,"","","","","",""]
[null,null,null,null,"","","","","",""]
[null,null,null,null,"","","","","",""]
[null,null,null,null,"","","","","",""]
[null,null,null,null,"","","","","",""]
[null,null,null,null,"","","","","",""]
[null,null,null,null,"","","","","",""]
[null,null,null,null,"","","","","",""]

{"sheet":"Hank.työ 1","index":3,"n_rows":193,"n_cols":29,"rows_kept":193,"cut":false,"hidden":false,"merged":[[164,2,164,3],[164,5,164,6],[164,7,164,8],[164,10,164,11],[164,13,164,14],[164,15,164,16],[92,148,92,149],[92,151,92,152],[129,2,129,3],[129,5,129,6],[129,7,129,8],[129,10,129,11],[129,13,129,14],[129,15,129,16],[92,132,92,133],[92,145,92,146],[92,135,92,136],[92,137,92,138],[92,140,92,141],[92,143,92,144],[92,87,92,88],[92,89,92,90],[92,92,92,93],[92,95,92,96],[92,129,92,130],[92,116,92,117],[92,119,92,120],[92,121,92,122],[92,124,92,125],[92,127,92,128],[92,111,92,112],[92,113,92,114],[92,100,92,101],[92,103,92,104],[92,105,92,106],[92,108,92,109],[94,2,94,3],[94,5,94,6],[94,7,94,8],[94,10,94,11],[92,84,92,85],[92,79,92,80],[24,33,24,34],[24,36,24,37],[92,55,92,56],[92,57,92,58],[58,36,58,37],[92,44,92,45],[24,63,24,64],[92,47,92,48],[94,26,94,27],[94,13,94,14],[92,68,92,69],[24,65,24,66],[58,68,58,69],[92,49,92,50],[92,71,92,72],[58,65,58,66],[92,63,92,64],[58,49,58,50],[24,154,24,155],[58,55,58,56],[58,57,58,58],[58,47,58,48],[58,44,58,45],[10,8,10,9],[59,2,59,3],[59,15,59,16],[92,76,92,77],[24,28,24,29],[24,2,24,3],[24,10,24,11],[92,31,92,32],[59,10,59,11],[24,41,24,42],[24,49,24,50],[59,5,59,6],[59,7,59,8],[24,52,24,53],[24,44,24,45],[24,31,24,32],[24,15,24,16],[24,47,24,48],[92,41,92,42],[16,8,16,9],[58,31,58,32],[58,41,58,42],[92,33,92,34],[92,36,92,37],[58,33,58,34],[59,13,59,14],[59,26,59,27],[7,14,9,14],[17,8,17,9],[24,7,24,8],[15,8,15,9],[11,8,11,9],[12,8,12,9],[22,7,22,8],[58,39,58,40],[24,39,24,40],[92,39,92,40],[92,28,92,29],[59,21,59,22],[59,24,59,25],[23,7,23,8],[24,13,24,14],[92,97,92,98],[92,52,92,53],[58,52,58,53],[58,71,58,72],[24,116,24,117],[24,119,24,120],[58,135,58,136],[58,121,58,122],[24,121,24,122],[24,76,24,77],[24,79,24,80],[24,81,24,82],[24,84,24,85],[24,87,24,88],[24,100,24,101],[24,97,24,98],[24,92,24,93],[58,97,58,98],[58,79,58,80],[24,111,24,112],[24,103,24,104],[24,105,24,106],[24,108,24,109],[92,81,92,82],[24,151,24,152],[24,140,24,141],[24,145,24,146],[58,148,58,149],[58,151,58,152],[24,143,24,144],[58,143,58,144],[58,145,58,146],[24,124,24,125],[24,127,24,128],[24,129,24,130],[24,132,24,133],[24,135,24,136],[24,137,24,138],[58,132,58,133],[58,129,58,130],[24,148,24,149],[58,124,58,125],[58,137,58,138],[58,140,58,141],[58,127,58,128],[164,21,164,22],[7,20,10,27],[164,24,164,25],[164,26,164,27],[24,21,24,22],[24,24,24,25],[24,26,24,27],[92,60,92,61],[92,73,92,74],[24,55,24,56],[24,57,24,58],[24,60,24,61],[58,60,58,61],[58,63,58,64],[92,65,92,66],[58,116,58,117],[58,119,58,120],[58,105,58,106],[58,108,58,109],[58,111,58,112],[24,89,24,90],[24,68,24,69],[58,73,58,74],[24,71,24,72],[24,73,24,74],[24,113,24,114],[58,76,58,77],[58,113,58,114],[58,100,58,101],[58,95,58,96],[58,81,58,82],[58,84,58,85],[58,87,58,88],[58,89,58,90],[58,92,58,93],[58,103,58,104],[24,95,24,96],[3,10,3,11],[3,20,3,21],[1,20,1,27],[6,20,6,27],[129,21,129,22],[129,24,129,25],[129,26,129,27],[94,21,94,22],[94,24,94,25],[18,20,18,27],[7,16,9,16],[94,15,94,16],[7,15,9,15],[1,5,1,14],[2,5,2,14],[24,5,24,6],[4,8,4,9],[5,8,5,9],[6,8,6,9],[13,8,13,9],[14,8,14,9],[7,8,7,9],[8,8,8,9],[9,8,9,9]]}
["Mette 2016"]
["Metsätalouden kirjanpito",null,null,null,null,{"$f":"Etusivu!C10","v":"RAJOITETTU TESTIVESIO"},null,null,null,null,null,null,null,null,null,null,null,null,null,null,{"$f":"CONCATENATE(\"Verovuodelta \",Etusivu!B7-1,\" uinumaan jätetyn hankintatyön arvo, Euroa\")","v":"Verovuodelta 2015 uinumaan jätetyn hankintatyön arvo, Euroa"}]
["Hankintatyön arvon  laskenta",null,null,"Y-tunnus ",{"$f":"Etusivu!C14","v":"1322222-2"},{"$f":"Etusivu!E10","v":"Testitila 1:45"},null,null,null,null,null,null,null,null,null,"ohje",null,null,null,null,null,null,"YHTEENSÄ","Maatila 1","Maatila 2","Maatila 3","Maatila 4","Maatila 5"]
["Normaali hankintatyö (1.2.)",null,null,null,null,null,null,null,null,null,"Kuljetuksen konekustan-\nnukset käytössä",null,"Ei",null,null,"#### - ohje",null,null,null,null,"Hankintatyön arvo, €",null,{"$f":"SUM(X4:AB4)","v":0},null,null,0,0,0]
[null,null,"Maatila 1","Maatila 2","Maatila 3","Maatila 4","Maatila 5",null,"Täyttöoppaan taksat",null,"Valmistus","Kuljetus","Kulj. Konekust."]
["Hankintakauppatulot maatilalta",null,{"$f":"P11+Q11","v":3450},{"$f":"+P12+Q12","v":0},{"$f":"+P13+Q13","v":0},{"$f":"+P14+Q14","v":0},{"$f":"+P15+Q15","v":0},"€","Mäntykuitu",null,12.52,2.2200000000000002,{"$f":"IF(M$4=\"kyllä\",N6,0)","v":0},3.33]
["Puutavaran verollinen arvo",null,{"$f":"IF(B48>=0,B48,\"- arvo tarkista\")","v":3131.79},{"$f":"IF(B83>=0,B83,\"- arvo tarkista\")","v":0},{"$f":"IF(B118>=0,B118,\"- arvo tarkista\")","v":0},{"$f":"IF(B153>=0,B153,\"- arvo tarkista\")","v":0},{"$f":"IF(B188>=0,B188,\"- arvo tarkista\")","v":0},"€","Kuusikuitu",null,13.1,2.36,0,3.53,"Aputaulukko: Tulot maatiloittain",null,null,null,null,null,{"$f":"CONCATENATE(\"Verovuoden \",Etusivu!B$7,\" uinumaan jäävä hankintatyö\")","v":"Verovuoden 2016 uinumaan jäävä hankintatyö"}]
["Konekustannusosuus (vuosimenoa)",null,{"$f":"+B45","v":0},{"$f":"+B80","v":0},{"$f":"+B115","v":0},{"$f":"+B150","v":0},{"$f":"+B185","v":0},"€","Koivukuitu",null,11.58,2.59,0,3.89,"Maatila","EI metsävähen- nysoikeutta","Metsävähen-nysoikeus",null,null,null,"TÄHÄN ALLE VAIN NE KUUTIOMÄÄRÄT JOTKA ON TEHTY VEROVUONNA, \nMUTTA MYYDÄÄN TULEVANA VEROVUONNA\nSiirrä seuraavan vuoden veroilmoitukseen hankintatyön arvoon (lomake 2C kohta 2.1)"]
["Valmistettu määrä yhteensä",null,{"$f":"+B46","v":21},{"$f":"+B81","v":0},{"$f":"+B116","v":0},{"$f":"+B151","v":0},{"$f":"+B186","v":0},"m3","Mäntytukki",null,5.42,2.15,0,3.22]
["Valmistuksen arvo yhteensä",null,{"$f":"+B43","v":267.5},{"$f":"+B78","v":0},{"$f":"+B113","v":0},{"$f":"+B148","v":0},{"$f":"+B183","v":0},"€","Kuusitukki",null,6.98,2.17,0,3.26]
["Valmistuksen verollinen arvo (125 m3 verovapaata työtä)",null,{"$f":"IF(C9+'Hank.työ 2'!C9=0,0,IF((C9+'Hank.työ 2'!C9-125)/(C9+'Hank.työ 2'!C9)*C10>0,(C9+'Hank.työ 2'!C9-125)/(C9+'Hank.työ 2'!C9)*C10,0))","v":0},{"$f":"IF(D9+'Hank.työ 2'!D9=0,0,IF((D9+'Hank.työ 2'!D9-125)/(D9+'Hank.työ 2'!D9)*D10>0,(D9+'Hank.työ 2'!D9-125)/(D9+'Hank.työ 2'!D9)*D10,0))","v":0},{"$f":"IF(E9+'Hank.työ 2'!E9=0,0,IF((E9+'Hank.työ 2'!E9-125)/(E9+'Hank.työ 2'!E9)*E10>0,(E9+'Hank.työ 2'!E9-125)/(E9+'Hank.työ 2'!E9)*E10,0))","v":0},{"$f":"IF(F9+'Hank.työ 2'!F9=0,0,IF((F9+'Hank.työ 2'!F9-125)/(F9+'Hank.työ 2'!F9)*F10>0,(F9+'Hank.työ 2'!F9-125)/(F9+'Hank.työ 2'!F9)*F10,0))","v":0},{"$f":"IF(G9+'Hank.työ 2'!G9=0,0,IF((G9+'Hank.työ 2'!G9-125)/(G9+'Hank.työ 2'!G9)*G10>0,(G9+'Hank.työ 2'!G9-125)/(G9+'Hank.työ 2'!G9)*G10,0))","v":0},"€","Koivutukki",null,5.15,2.46,0,3.7,1,{"$f":"Tulot!AA7+Tulot!F171","v":0},{"$f":"Tulot!AB7+Tulot!I171","v":3450}]
["Kuljetuksen määrä yhteensä",null,{"$f":"+B47","v":21},{"$f":"+B82","v":0},{"$f":"+B117","v":0},{"$f":"+B152","v":0},{"$f":"+B187","v":0},"m3","Lahopuu",null,null,null,null,null,2,{"$f":"Tulot!AC7","v":0},{"$f":"Tulot!AD7","v":0}]
["kuljetuksen arvo yhteensä",null,{"$f":"+B44","v":50.71},{"$f":"+B79","v":0},{"$f":"+B114","v":0},{"$f":"+B149","v":0},{"$f":"+B184","v":0},"€","Erikoispuu",null,null,null,null,null,3,{"$f":"Tulot!AE7","v":0},{"$f":"Tulot!AF7","v":0},null,null,null,null,null,null,"Maatila 1","Maatila 2","Maatila 3","Maatila 4","Maatila 5"]
["Kuljetuksen verollinen arvo (125 m3 verovapaata työtä)",null,{"$f":"IF(C12+'Hank.työ 2'!C12=0,0,IF((C12+'Hank.työ 2'!C12-125)/(C12+'Hank.työ 2'!C12)*C13>0,(C12+'Hank.työ 2'!C12-125)/(C12+'Hank.työ 2'!C12)*C13,0))","v":0},{"$f":"IF(D12+'Hank.työ 2'!D12=0,0,IF((D12+'Hank.työ 2'!D12-125)/(D12+'Hank.työ 2'!D12)*D13>0,(D12+'Hank.työ 2'!D12-125)/(D12+'Hank.työ 2'!D12)*D13,0))","v":0},{"$f":"IF(E12+'Hank.työ 2'!E12=0,0,IF((E12+'Hank.työ 2'!E12-125)/(E12+'Hank.työ 2'!E12)*E13>0,(E12+'Hank.työ 2'!E12-125)/(E12+'Hank.työ 2'!E12)*E13,0))","v":0},{"$f":"IF(F12+'Hank.työ 2'!F12=0,0,IF((F12+'Hank.työ 2'!F12-125)/(F12+'Hank.työ 2'!F12)*F13>0,(F12+'Hank.työ 2'!F12-125)/(F12+'Hank.työ 2'!F12)*F13,0))","v":0},{"$f":"IF(G12+'Hank.työ 2'!G12=0,0,IF((G12+'Hank.työ 2'!G12-125)/(G12+'Hank.työ 2'!G12)*G13>0,(G12+'Hank.työ 2'!G12-125)/(G12+'Hank.työ 2'!G12)*G13,0))","v":0},"€","Energiapuu (kokopuu)",null,7.73,4.05,{"$f":"IF(M$4=\"kyllä\",N14,0)","v":0},6.08,4,{"$f":"Tulot!AG7","v":0},{"$f":"Tulot!AH7","v":0},null,null,null,"Valmistettu määrä yhteensä",null,null,{"$f":"AB46","v":0},{"$f":"AB81","v":0},{"$f":"AB116","v":0},{"$f":"AB151","v":0},{"$f":"AB186","v":0},"m3"]
["Hankintatyön arvo yhteensä",null,{"$f":"C10+C13","v":318.20999999999998},{"$f":"D10+D13","v":0},{"$f":"E10+E13","v":0},{"$f":"F10+F13","v":0},{"$f":"G10+G13","v":0},"€","Halot ja klapit (tukkumyynti)",null,26.26,2.59,{"$f":"IF(M$4=\"kyllä\",N15,0)","v":0},3.89,5,{"$f":"Tulot!AI7","v":0},{"$f":"Tulot!AJ7","v":0},null,null,null,"Valmistuksen arvo yhteensä",null,null,{"$f":"AB43","v":0},{"$f":"AB78","v":0},{"$f":"AB113","v":0},{"$f":"AB148","v":0},{"$f":"AB183","v":0},"€"]
["Hankintatyön verollinen arvo yhteensä",null,{"$f":"(C11+C14)","v":0},{"$f":"(D11+D14)","v":0},{"$f":"(E11+E14)","v":0},{"$f":"(F11+F14)","v":0},{"$f":"(G11+G14)","v":0},"€","Haketus",null,4.0999999999999996,null,null,null,"yhteensä",{"$f":"SUM(P11:P15)","v":0},{"$f":"SUM(Q11:Q15)","v":3450},null,null,null,"Kuljetuksen määrä yhteensä",null,null,{"$f":"AB47","v":0},{"$f":"AB82","v":0},{"$f":"AB117","v":0},{"$f":"AB152","v":0},{"$f":"AB187","v":0},"m3"]
["Hakkuumäärä yht. verovuonna (sis. hank.työ 1 ja 2)",null,{"$f":"C9+'Hank.työ 2'!C9","v":21},{"$f":"D9+'Hank.työ 2'!D9","v":0},{"$f":"E9+'Hank.työ 2'!E9","v":0},{"$f":"F9+'Hank.työ 2'!F9","v":0},{"$f":"G9+'Hank.työ 2'!G9","v":0},null,"Hake ",null,null,2.59,{"$f":"IF(M$4=\"kyllä\",N17,0)","v":0},3.89,null,null,null,null,null,null,"kuljetuksen arvo yhteensä",null,null,{"$f":"AB44","v":0},{"$f":"AB79","v":0},{"$f":"AB114","v":0},{"$f":"AB149","v":0},{"$f":"AB184","v":0},"€"]
[null,null,null,null,null,null,null,null,"Joulupuut (ytukkumyynti)",null,null,null,null,null,null,null,null,null,null,null,"HANKINTATYÖN ARVO YHTEENSÄ",null,null,{"$f":"X15+X17","v":0},{"$f":"Y15+Y17","v":0},{"$f":"Z15+Z17","v":0},{"$f":"AA15+AA17","v":0},{"$f":"AB15+AB17","v":0},"€"]
["Uinumaan jäävän hankintatyön laskenta oikealla sarakkeilla U - AB",null,null,null,null,null,null,null,null,null,null,null,null,null,null,null,null,null,null,null,"Siirrä nämä alarivin summat seuraavan vuoden verotukseen uinumaan jätettyinä hankintatyön arvoina."]
[]
["MAATILA 1","Maatila 1, tilat joilla ei metsävähennysoikeutta",null,null,null,null,null,null,null,"Maatila 1, tilat joilla metsävähennysoikeus",null,null,null,null,null,null,null,null,null,null,"Maatila 1, Hakkuu verovuonna - Puun myynti seuraavana vuonna. UINUMAAN JÄÄVÄ HAKKUUMÄÄRÄ"]
["Kunta:","HAKKUU",null,null,"KULJETUS",null,null,"Ohje konekustannus",null,"HAKKUU",null,null,"KULJETUS",null,null,"Ohje konekustannus",null,null,null,null,"HAKKUU",null,null,"KULJETUS",null,null,"Ohje konekustannus"]
[null,{"$f":"P$11","v":0},null,null,null,null,null,null,null,{"$f":"Q11","v":3450}]
[]
[null,null,"valmistuksen arvo",null,"Määrä","Kuljetustyön arvo",null,"Konekustannus",null,null,"valmistuksen arvo",null,"Määrä","Kuljetustyön arvo",null,"Konekustannus",null,null,null,null,null,"valmistuksen arvo",null,"Määrä","Kuljetustyön arvo",null,"Konekustannus"]
[null,"m3","€/m3","€","m3","€/m3"," \n€","€/m3","\n€","m3","€/m3","€","m3","€/m3"," \n€","€/m3","\n€",null,null,null,"m3","€/m3","€","m3","€/m3"," \n€","€/m3","\n€"]
["Mäntykuitu",null,{"$f":"$K6","v":12.52},{"$f":"B27*C27","v":0},0,{"$f":"$L6","v":2.2200000000000002},{"$f":"E27*F27","v":0},{"$f":"$M6","v":0},{"$f":"H27*E27","v":0},0,{"$f":"$K6","v":12.52},{"$f":"J27*K27","v":0},0,{"$f":"      $L6","v":2.2200000000000002},{"$f":"M27*N27","v":0},{"$f":"$M6","v":0},{"$f":"P27*M27","v":0},null,null,"MäK",null,{"$f":"$K6","v":12.52},{"$f":"U27*V27","v":0},0,{"$f":"      $L6","v":2.2200000000000002},{"$f":"X27*Y27","v":0},{"$f":"$M6","v":0},{"$f":"AA27*X27","v":0}]
["Kuusikuitu",null,13.1,0,null,2.36,{"$f":"E28*F28","v":0},0,{"$f":"H28*E28","v":0},16,13.1,209.6,16,2.36,37.76,0,{"$f":"P28*M28","v":0},null,null,"KuK",null,13.1,0,null,2.36,0,0,{"$f":"AA28*X28","v":0}]
["Koivukuitu",null,11.58,0,null,2.59,0,0,0,5,11.58,57.9,5,2.59,12.95,0,0,null,null,"KoK",0,11.58,0,0,2.59,0,0,0]
["Mäntytukki",0,5.42,0,0,2.15,0,0,0,0,5.42,0,0,2.15,0,0,0,null,null,"MäT",0,5.42,0,0,2.15,0,0,0]
["Kuusitukki",0,6.98,0,0,2.17,0,0,0,0,6.98,0,0,2.17,0,0,0,null,null,"KuK",null,6.98,0,0,2.17,0,0,0]
["Koivutukki",null,5.15,0,null,2.46,0,0,0,0,5.15,0,0,2.46,0,0,0,null,null,"KoT",0,5.15,0,0,2.46,0,0,0]
["Lahopuu",0,0,0,0,0,0,0,0,0,0,0,0,0,0,0,0,null,null,"Laho",0,0,0,0,0,0,0,0]
["Erikoispuu",0,0,{"$f":"B34*C34","v":0},0,0,0,0,{"$f":"H34*E34","v":0},0,0,{"$f":"J34*K34","v":0},0,0,{"$f":"M34*N34","v":0},0,{"$f":"P34*M34","v":0},null,null,"Erikpuu",0,0,{"$f":"U34*V34","v":0},0,0,{"$f":"X34*Y34","v":0},0,{"$f":"AA34*X34","v":0}]
["Energiapuu (kokopuu)",0,7.73,{"$f":"B35*C35","v":0},0,4.05,0,0,{"$f":"H35*E35","v":0},0,7.73,{"$f":"J35*K35","v":0},0,4.05,{"$f":"M35*N35","v":0},0,{"$f":"P35*M35","v":0},null,null,"Energ.puu",0,7.73,{"$f":"U35*V35","v":0},0,4.05,{"$f":"X35*Y35","v":0},0,{"$f":"AA35*X35","v":0}]
["Halot ja klapit (tukkumyynti)",null,26.26,{"$f":"B36*C36","v":0},null,2.59,0,0,{"$f":"H36*E36","v":0},0,26.26,{"$f":"J36*K36","v":0},0,2.59,{"$f":"M36*N36","v":0},0,{"$f":"P36*M36","v":0},null,null,"Halot ja klapit",0,26.26,{"$f":"U36*V36","v":0},0,2.59,{"$f":"X36*Y36","v":0},0,{"$f":"AA36*X36","v":0}]
["Haketus",0,{"$f":"$K16","v":4.0999999999999996},{"$f":"B37*C37","v":0},0," -"," -",{"$f":"$M16","v":0},{"$f":"H37*E37","v":0},0,{"$f":"$K16","v":4.0999999999999996},{"$f":"J37*K37","v":0},0," - "," - ",{"$f":"$M16","v":0},{"$f":"P37*M37","v":0},null,null,"Haketus",0,4.0999999999999996,{"$f":"U37*V37","v":0},0," - "," - ",0,{"$f":"AA37*X37","v":0}]
["Hake ",0," - "," - ",0,{"$f":"$L17","v":2.59},0,{"$f":"$M17","v":0},{"$f":"H38*E38","v":0},0," - "," - ",0,{"$f":"      $L17","v":2.59},{"$f":"M38*N38","v":0},{"$f":"$M17","v":0},{"$f":"P38*M38","v":0},null,null,"Hake ",0," - "," - ",0,{"$f":"      $L17","v":2.59},{"$f":"X38*Y38","v":0},{"$f":"$M17","v":0},{"$f":"AA38*X38","v":0}]
["Joulupuut (tukkumyynti)",null,{"$f":"$K$18","v":0},{"$f":"B39*C39","v":0},null,{"$f":"$L$18","v":0},null,{"$f":"$M$18","v":0},null,null,{"$f":"$K$18","v":0},{"$f":"J39*K39","v":0},null,{"$f":"$L$18","v":0},null,{"$f":"$M$18","v":0},null,null,null,"Joulupuu",null,{"$f":"$K$18","v":0},null,null,{"$f":"$L$18","v":0},null,{"$f":"$M$18","v":0}]
["Yhteensä",{"$f":"SUM(B27:B39)","v":0},null,{"$f":"SUM(D27:D39)","v":0},{"$f":"SUM(E27:E39)","v":0},null,{"$f":"SUM(G27:G39)","v":0},null,{"$f":"SUM(I27:I39)","v":0},{"$f":"SUM(J27:J39)","v":21},null,{"$f":"SUM(L27:L39)","v":267.5},{"$f":"SUM(M27:M39)","v":21},null,{"$f":"SUM(O27:O39)","v":50.71},null,{"$f":"SUM(Q27:Q39)","v":0},null,null,"Yhteensä",{"$f":"SUM(U27:U39)","v":0},null,{"$f":"SUM(W27:W39)","v":0},{"$f":"SUM(X27:X39)","v":0},null,{"$f":"SUM(Z27:Z39)","v":0},null,{"$f":"SUM(AB27:AB39)","v":0}]
[]
[null,"YHTEENSÄ",null,null,null,null,null,null,"Ei metsävähennystä",null,null,null,null,null,null,null,"Metsävähennykseen oikeutettujen tilojen hakkuut"]
["Hakkuutyön arvo",{"$f":"I43+Q43","v":267.5},null,null,null,null,null,"Hakkuutyön arvo",{"$f":"D40","v":0},null,null,null,null,null,null,"Hakkuutyön arvo",{"$f":"L40","v":267.5},null,null,null,null,null,null,null,null,null,"Hakkuutyön arvo",{"$f":"W40","v":0}]
["Kuljetuksen arvo",50.71,null,null,null,null,null,"Kuljetuksen arvo",{"$f":"G40","v":0},null,null,null,null,null,null,"Kuljetuksen arvo",{"$f":"O40","v":50.71},null,null,null,null,null,null,null,null,null,"Kuljetuksen arvo",{"$f":"Z40","v":0}]
["Konekustannus (muuta vuosimenoa)",0,null,null,null,null,null,"Konekustannus",{"$f":"I40","v":0},null,null,null,null,null,null,"Konekustannus",{"$f":"Q40","v":0},null,null,null,null,null,null,null,null,null,"Konekustannus",{"$f":"AB40","v":0}]
["Hakkuun määrä yhteensä",21,null,null,null,null,null,"Hakkuun määrä",{"$f":"B40","v":0},null,null,null,null,null,null,"Hakkuun määrä",{"$f":"J40","v":21},null,null,null,null,null,null,null,null,null,"Hakkuun määrä",{"$f":"U40","v":0}]
["Kuljetuksen määrä yhteensä",21,null,null,null,null,null,"Kuljetuksen määrä",{"$f":"E40","v":0},null,null,null,null,null,null,"Kuljetuksen määrä",{"$f":"M40","v":21},null,null,null,null,null,null,null,null,null,"Kuljetuksen määrä",{"$f":"X40","v":0}]
["Puutavaran verollinen arvo",3131.79,null,null,null,null,null,"Puutavaran verollinen arvo",{"$f":"(B23-I43-I44-I45)","v":0},null,null,null,null,null,null,"Metsävähennykseen oikeuttava osa (verollinen osa)",{"$f":"(J23-Q43-Q44-Q45)","v":3131.79}]
[]
[]
[null,"Hakattu määrä yhteensä",{"$f":"B46","v":21}]
[null,"Kuljetettu määrä yhteensä",{"$f":"B47","v":21}]
["Tarkistus:",{"$f":"IF(C52>C51,\"Kuljetettu määrä on valmistettua määrää suurempi\",IF(C52=C51,\"Valmistettu ja kuljetettu määrä yhtäsuuret\",\"Valmistettu määrä on kuljetettua määrää isompi\"))","v":"Valmistettu ja kuljetettu määrä yhtäsuuret"}]
[]
[]
["MAATILA 2","Maatila 2, tilat joilla ei metsävähennysoikeutta",null,null,null,null,null,null,null,"Maatila 2, tilat joilla metsävähennysoikeus",null,null,null,null,null,null,null,null,null,null,"Maatila 2, Hakkuu verovuonna - Puun myynti seuraavana vuonna. UINUMAAN JÄÄVÄ HAKKUUMÄÄRÄ"]
["Kunta:","HAKKUU",null,null,"KULJETUS",null,null,null,null,"HAKKUU",null,null,"KULJETUS",null,null,null,null,null,null,null,"HAKKUU",null,null,"KULJETUS"]
[null,{"$f":"P$12","v":0},null,null,null,null,null,"Ohje konekustannus",null,{"$f":"Q12","v":0},null,null,null,null,null,"Ohje konekustannus",null,null,null,null,null,null,null,null,null,null,"Ohje konekustannus"]
[]
[null,null,"valmistuksen arvo",null,"Määrä","Kuljetustyön arvo",null,"Konekustannus",null,null,"valmistuksen arvo",null,"Määrä","Kuljetustyön arvo",null,"Konekustannus",null,null,null,null,null,"valmistuksen arvo",null,"Määrä","Kuljetustyön arvo",null,"Konekustannus"]
[null,"m3","€/m3","€","m3","€/m3"," \n€","€/m3","\n€","m3","€/m3","€","m3","€/m3"," \n€","€/m3","\n€",null,null,null,"m3","€/m3","€","m3","€/m3"," \n€","€/m3","\n€"]
["Mäntykuitu",0,{"$f":"$K6","v":12.52},{"$f":"B62*C62","v":0},0,{"$f":"$L6","v":2.2200000000000002},{"$f":"E62*F62","v":0},{"$f":"$M6","v":0},{"$f":"H62*E62","v":0},0,{"$f":"$K6","v":12.52},{"$f":"J62*K62","v":0},0,{"$f":"$L6","v":2.2200000000000002},{"$f":"M62*N62","v":0},{"$f":"$M6","v":0},{"$f":"P62*M62","v":0},null,null,"MäK",0,{"$f":"$K6","v":12.52},{"$f":"U62*V62","v":0},0,{"$f":"$L6","v":2.2200000000000002},{"$f":"X62*Y62","v":0},{"$f":"$M6","v":0},{"$f":"AA62*X62","v":0}]
["Kuusikuitu",0,13.1,0,0,2.36,{"$f":"E63*F63","v":0},0,{"$f":"H63*E63","v":0},0,13.1,0,0,2.36,0,0,{"$f":"P63*M63","v":0},null,null,"KuK",0,13.1,0,0,2.36,0,0,{"$f":"AA63*X63","v":0}]
["Koivukuitu",0,11.58,0,0,2.59,0,0,0,0,11.58,0,0,2.59,0,0,0,null,null,"KoK",0,11.58,0,0,2.59,0,0,0]
["Mäntytukki",0,5.42,0,0,2.15,0,0,0,0,5.42,0,0,2.15,0,0,0,null,null,"MäT",0,5.42,0,0,2.15,0,0,0]
["Kuusitukki",0,6.98,0,0,2.17,0,0,0,0,6.98,0,0,2.17,0,0,0,null,null,"KuK",0,6.98,0,0,2.17,0,0,0]
["Koivutukki",0,5.15,0,0,2.46,0,0,0,0,5.15,0,0,2.46,0,0,0,null,null,"KoT",0,5.15,0,0,2.46,0,0,0]
["Lahopuu",0,0,0,0,0,0,0,0,0,0,0,0,0,0,0,0,null,null,"Laho",0,0,0,0,0,0,0,0]
["Erikoispuu",0,0,{"$f":"B69*C69","v":0},0,0,0,0,{"$f":"H69*E69","v":0},0,0,{"$f":"J69*K69","v":0},0,0,{"$f":"M69*N69","v":0},0,{"$f":"P69*M69","v":0},null,null,"Erikpuu",0,0,{"$f":"U69*V69","v":0},0,0,{"$f":"X69*Y69","v":0},0,{"$f":"AA69*X69","v":0}]
["Energiapuu (kokopuu)",0,7.73,{"$f":"B70*C70","v":0},0,4.05,0,0,{"$f":"H70*E70","v":0},0,7.73,{"$f":"J70*K70","v":0},0,4.05,{"$f":"M70*N70","v":0},0,{"$f":"P70*M70","v":0},null,null,"Energ.puu",0,7.73,{"$f":"U70*V70","v":0},0,4.05,{"$f":"X70*Y70","v":0},0,{"$f":"AA70*X70","v":0}]
["Halot ja klapit",0,26.26,{"$f":"B71*C71","v":0},0,2.59,0,0,{"$f":"H71*E71","v":0},0,26.26,{"$f":"J71*K71","v":0},0,2.59,{"$f":"M71*N71","v":0},0,{"$f":"P71*M71","v":0},null,null,"Halot ja klapit",0,26.26,{"$f":"U71*V71","v":0},0,2.59,{"$f":"X71*Y71","v":0},0,{"$f":"AA71*X71","v":0}]
["Haketus",0,4.0999999999999996,{"$f":"B72*C72","v":0},0," -"," -",0,{"$f":"H72*E72","v":0},0,4.0999999999999996,{"$f":"J72*K72","v":0},0," - "," -",0,{"$f":"P72*M72","v":0},null,null,"Haketus",0,4.0999999999999996,{"$f":"U72*V72","v":0},0," - "," -",0,{"$f":"AA72*X72","v":0}]
["Hake ",0," - "," - ",0,{"$f":"$L17","v":2.59},0,0,0,0," -"," -",0,{"$f":"$L17","v":2.59},0,0,0,null,null,"Hake ",0," -"," -",0,{"$f":"$L17","v":2.59},{"$f":"X73*Y73","v":0},0,{"$f":"AA73*X73","v":0}]
["Joulupuut (tukkumyynti)",null,{"$f":"$K$18","v":0},{"$f":"B74*C74","v":0},null,{"$f":"$L$18","v":0},null,{"$f":"$M$18","v":0},null,null,{"$f":"$K$18","v":0},{"$f":"J74*K74","v":0},null,{"$f":"$L$18","v":0},null,{"$f":"$M$18","v":0},null,null,null,"Joulupuu",null,{"$f":"$K$18","v":0},null,null,{"$f":"$L$18","v":0},null,{"$f":"$M$18","v":0}]
["Yhteensä",{"$f":"SUM(B62:B74)","v":0},null,{"$f":"SUM(D62:D74)","v":0},{"$f":"SUM(E62:E74)","v":0},null,{"$f":"SUM(G62:G74)","v":0},null,{"$f":"SUM(I62:I74)","v":0},{"$f":"SUM(J62:J74)","v":0},null,{"$f":"SUM(L62:L74)","v":0},{"$f":"SUM(M62:M74)","v":0},null,{"$f":"SUM(O62:O74)","v":0},null,{"$f":"SUM(Q62:Q74)","v":0},null,null,"Yhteensä",{"$f":"SUM(U62:U74)","v":0},null,{"$f":"SUM(W62:W74)","v":0},{"$f":"SUM(X62:X74)","v":0},null,{"$f":"SUM(Z62:Z74)","v":0},null,{"$f":"SUM(AB62:AB74)","v":0}]
[]
[null,"YHTEENSÄ",null,null,null,null,null,null,"Ei metsävähennystä",null,null,null,null,null,null,null,"Metsävähennykseen oikeutettujen tilojen hakkuut"]
["Hakkuutyön arvo yhteensä",{"$f":"I78+Q78","v":0},null,null,null,null,null,"Hakkuutyön arvo",{"$f":"D75","v":0},null,null,null,null,null,null,"Hakkuutyön arvo",{"$f":"L75","v":0},null,null,null,null,null,null,null,null,null,"Hakkuutyön arvo",{"$f":"W75","v":0}]
["Kuljetuksen arvo yhteensä",0,null,null,null,null,null,"Kuljetuksen arvo",{"$f":"G75","v":0},null,null,null,null,null,null,"Kuljetuksen arvo",{"$f":"O75","v":0},null,null,null,null,null,null,null,null,null,"Kuljetuksen arvo",{"$f":"Z75","v":0}]
["Konekustannus (Muuta vuosimenoa)",0,null,null,null,null,null,"Konekustannus",{"$f":"I75","v":0},null,null,null,null,null,null,"Konekustannus",{"$f":"Q75","v":0},null,null,null,null,null,null,null,null,null,"Konekustannus",{"$f":"AB75","v":0}]
["Hakkuun määrä yhteensä",0,null,null,null,null,null,"Hakkuun määrä",{"$f":"B75","v":0},null,null,null,null,null,null,"Hakkuun määrä",{"$f":"J75","v":0},null,null,null,null,null,null,null,null,null,"Hakkuun määrä",{"$f":"U75","v":0}]
["Kuljetuksen määrä yhteensä",0,null,null,null,null,null,"Kuljetuksen määrä",{"$f":"E75","v":0},null,null,null,null,null,null,"Kuljetuksen määrä",{"$f":"M75","v":0},null,null,null,null,null,null,null,null,null,"Kuljetuksen määrä",{"$f":"X75","v":0}]
["Puutavaran verollinen arvo",0,null,null,null,null,null,"Puutavaran verollinen arvo",{"$f":"(B58-I78-I79-I80)","v":0},null,null,null,null,null,null,"Metsävähennykseen oikeuttava osa (verollinen osa)",{"$f":"(J58-Q78-Q79-Q80)","v":0}]
[]
[]
["Tarkistus",null,"Hakattu määrä yhteensä",{"$f":"B81","v":0}]
[null,null,"Kuljetettu määrä yhteensä",{"$f":"B82","v":0}]
["Määrätarkistus:",{"$f":"IF(D87>D86,\"Kuljetettu määrä on valmistettua määrää suurempi\",IF(D87=D86,\"Valmistettu ja kuljetettu määrä yhtäsuuret\",\"Valmistettumääräonkuljetettuamäärääisompi\"))","v":"Valmistettu ja kuljetettu määrä yhtäsuuret"}]
[]
[]
["MAATILA 3","Maatila 3, tilat joilla ei metsävähennysoikeutta",null,null,null,null,null,null,null,"Maatila 3, tilat joilla metsävähennysoikeus",null,null,null,null,null,null,null,null,null,null,"Maatila 3, Hakkuu verovuonna - Puun myynti seuraavana vuonna. UINUMAAN JÄÄVÄ HAKKUUMÄÄRÄ"]
["Kunta:","HAKKUU",null,null,"KULJETUS",null,null,null,null,"HAKKUU",null,null,"KULJETUS",null,null,null,null,null,null,null,"HAKKUU",null,null,"KULJETUS"]
[null,{"$f":"P$13","v":0},null,null,null,null,null,"Ohje konekustannus",null,{"$f":"Q$13","v":0},null,null,null,null,null,"Ohje konekustannus",null,null,null,null,null,null,null,null,null,null,"Ohje konekustannus"]
[]
[null,null,"valmistuksen arvo",null,"Määrä","Kuljetustyön arvo",null,"Konekustannus",null,null,"valmistuksen arvo",null,"Määrä","Kuljetustyön arvo",null,"Konekustannus",null,null,null,null,null,"valmistuksen arvo",null,"Määrä","Kuljetustyön arvo",null,"Konekustannus"]
[null,"m3","€/m3","€","m3","€/m3"," \n€","€/m3","\n€","m3","€/m3","€","m3","€/m3"," \n€","€/m3","\n€",null,null,null,"m3","€/m3","€","m3","€/m3"," \n€","€/m3","\n€"]
["Mäntykuitu",0,{"$f":"$K6","v":12.52},{"$f":"B97*C97","v":0},0,{"$f":"$L6","v":2.2200000000000002},{"$f":"E97*F97","v":0},{"$f":"$M6","v":0},{"$f":"H97*E97","v":0},0,{"$f":"$K6","v":12.52},{"$f":"J97*K97","v":0},0,{"$f":"$L6","v":2.2200000000000002},{"$f":"M97*N97","v":0},{"$f":"$M6","v":0},{"$f":"P97*M97","v":0},null,null,"MäK",0,{"$f":"$K6","v":12.52},{"$f":"U97*V97","v":0},0,{"$f":"$L6","v":2.2200000000000002},{"$f":"X97*Y97","v":0},{"$f":"$M6","v":0},{"$f":"AA97*X97","v":0}]
["Kuusikuitu",0,13.1,0,0,2.36,{"$f":"E98*F98","v":0},0,{"$f":"H98*E98","v":0},0,13.1,0,0,2.36,0,0,{"$f":"P98*M98","v":0},null,null,"KuK",0,13.1,0,0,2.36,0,0,{"$f":"AA98*X98","v":0}]
["Koivukuitu",0,11.58,0,0,2.59,0,0,0,0,11.58,0,0,2.59,0,0,0,null,null,"KoK",0,11.58,0,0,2.59,0,0,0]
["Mäntytukki",0,5.42,0,0,2.15,0,0,0,0,5.42,0,0,2.15,0,0,0,null,null,"MäT",0,5.42,0,0,2.15,0,0,0]
["Kuusitukki",0,6.98,0,0,2.17,0,0,0,0,6.98,0,0,2.17,0,0,0,null,null,"KuK",0,6.98,0,0,2.17,0,0,0]
["Koivutukki",0,5.15,0,0,2.46,0,0,0,0,5.15,0,0,2.46,0,0,0,null,null,"KoT",null,5.15,0,0,2.46,0,0,0]
["Lahopuu",0,0,0,0,0,0,0,0,0,0,0,0,0,0,0,0,null,null,"Laho",0,0,0,0,0,0,0,0]
["Erikoispuu",0,0,{"$f":"B104*C104","v":0},0,0,0,0,{"$f":"H104*E104","v":0},0,0,{"$f":"J104*K104","v":0},0,0,{"$f":"M104*N104","v":0},0,{"$f":"P104*M104","v":0},null,null,"Erikpuu",0,0,{"$f":"U104*V104","v":0},0,0,{"$f":"X104*Y104","v":0},0,{"$f":"AA104*X104","v":0}]
["Energiapuu (kokopuu)",0,7.73,{"$f":"B105*C105","v":0},0,4.05,0,0,{"$f":"H105*E105","v":0},0,7.73,{"$f":"J105*K105","v":0},0,4.05,{"$f":"M105*N105","v":0},0,{"$f":"P105*M105","v":0},null,null,"Energ.puu",0,7.73,{"$f":"U105*V105","v":0},0,4.05,{"$f":"X105*Y105","v":0},0,{"$f":"AA105*X105","v":0}]
["Halot ja klapit",0,26.26,{"$f":"B106*C106","v":0},0,2.59,0,0,{"$f":"H106*E106","v":0},0,26.26,{"$f":"J106*K106","v":0},0,2.59,{"$f":"M106*N106","v":0},0,{"$f":"P106*M106","v":0},null,null,"Halot ja klapit",0,26.26,{"$f":"U106*V106","v":0},0,2.59,{"$f":"X106*Y106","v":0},0,{"$f":"AA106*X106","v":0}]
["Haketus",0,4.0999999999999996,{"$f":"B107*C107","v":0},0," -"," -",0,{"$f":"H107*E107","v":0},0,4.0999999999999996,{"$f":"J107*K107","v":0},0," - "," -",0,{"$f":"P107*M107","v":0},null,null,"Haketus",0,4.0999999999999996,{"$f":"U107*V107","v":0},0," - "," -",0,{"$f":"AA107*X107","v":0}]
["Hake ",0," - "," - ",0,{"$f":"$L17","v":2.59},{"$f":"E108*F108","v":0},0,{"$f":"H108*E108","v":0},0," -"," -",0,{"$f":"$L17","v":2.59},{"$f":"M108*N108","v":0},0,{"$f":"P108*M108","v":0},null,null,"Hake ",0," -"," -",0,{"$f":"$L17","v":2.59},{"$f":"X108*Y108","v":0},0,{"$f":"AA108*X108","v":0}]
["Joulupuut (tukkumyynti)",null,{"$f":"$K$18","v":0},{"$f":"B109*C109","v":0},null,{"$f":"$L$18","v":0},null,{"$f":"$M$18","v":0},null,null,{"$f":"$K$18","v":0},{"$f":"J109*K109","v":0},null,{"$f":"$L$18","v":0},null,{"$f":"$M$18","v":0},null,null,null,"Joulupuu",null,{"$f":"$K$18","v":0},null,null,{"$f":"$L$18","v":0},null,{"$f":"$M$18","v":0}]
["Yhteensä",{"$f":"SUM(B97:B109)","v":0},null,{"$f":"SUM(D97:D109)","v":0},{"$f":"SUM(E97:E109)","v":0},null,{"$f":"SUM(G97:G109)","v":0},null,{"$f":"SUM(I97:I109)","v":0},{"$f":"SUM(J97:J109)","v":0},null,{"$f":"SUM(L97:L109)","v":0},{"$f":"SUM(M97:M109)","v":0},null,{"$f":"SUM(O97:O109)","v":0},null,{"$f":"SUM(Q97:Q109)","v":0},null,null,"Yhteensä",{"$f":"SUM(U97:U109)","v":0},null,{"$f":"SUM(W97:W109)","v":0},{"$f":"SUM(X97:X109)","v":0},null,{"$f":"SUM(Z97:Z109)","v":0},null,{"$f":"SUM(AB97:AB109)","v":0}]
[]
[null,"YHTEENSÄ",null,null,null,null,null,null,"Ei metsävähennystä",null,null,null,null,null,null,null,"Metsävähennykseen oikeutettujen tilojen hakkuut"]
["Hakkuutyön arvo yhteensä",{"$f":"I113+Q113","v":0},null,null,null,null,null,"Hakkuutyön arvo",{"$f":"D110","v":0},null,null,null,null,null,null,"Hakkuutyön arvo",{"$f":"L110","v":0},null,null,null,null,null,null,null,null,null,"Hakkuutyön arvo",{"$f":"W110","v":0}]
["Kuljetuksen arvo yhteensä",0,null,null,null,null,null,"Kuljetuksen arvo",{"$f":"G110","v":0},null,null,null,null,null,null,"Kuljetuksen arvo",{"$f":"O110","v":0},null,null,null,null,null,null,null,null,null,"Kuljetuksen arvo",{"$f":"Z110","v":0}]
["Konekustannus (Muuta vuosimenoa)",0,null,null,null,null,null,"Konekustannus",{"$f":"I110","v":0},null,null,null,null,null,null,"Konekustannus",{"$f":"Q110","v":0},null,null,null,null,null,null,null,null,null,"Konekustannus",{"$f":"AB110","v":0}]
["Hakkuun määrä yhteensä",0,null,null,null,null,null,"Hakkuun määrä",{"$f":"B110","v":0},null,null,null,null,null,null,"Hakkuun määrä",{"$f":"J110","v":0},null,null,null,null,null,null,null,null,null,"Hakkuun määrä",{"$f":"U110","v":0}]
["Kuljetuksen määrä yhteensä",0,null,null,null,null,null,"Kuljetuksen määrä",{"$f":"E110","v":0},null,null,null,null,null,null,"Kuljetuksen määrä",{"$f":"M110","v":0},null,null,null,null,null,null,null,null,null,"Kuljetuksen määrä",{"$f":"X110","v":0}]
["Puutavaran verollinen arvo",0,null,null,null,null,null,"Puutavaran verollinen arvo",{"$f":"(B93-I113-I114-I115)","v":0},null,null,null,null,null,null,"Metsävähennykseen oikeuttava osa (verollinen osa)",{"$f":"(J93-Q113-Q114-Q115)","v":0}]
[]
[]
["Tarkistus",null,"Hakattu määrä yhteensä",{"$f":"B116","v":0}]
[null,null,"Kuljetettu määrä yhteensä",{"$f":"B117","v":0}]
["Määrätarkistus:",{"$f":"IF(D122>D121,\"Kuljetettu määrä on valmistettua määrää suurempi\",IF(D122=D121,\"Valmistettu ja kuljetettu määrä yhtäsuuret\",\"Valmistettumääräonkuljetettuamäärääisompi\"))","v":"Valmistettu ja kuljetettu määrä yhtäsuuret"}]
[]
[]
["MAATILA 4","Maatila 4, tilat joilla ei metsävähennysoikeutta",null,null,null,null,null,null,null,"Maatila 4, tilat joilla metsävähennysoikeus",null,null,null,null,null,null,null,null,null,null,"Maatila 4, Hakkuu verovuonna - Puun myynti seuraavana vuonna. UINUMAAN JÄÄVÄ HAKKUUMÄÄRÄ"]
["Kunta:","HAKKUU",null,null,"KULJETUS",null,null,null,null,"HAKKUU",null,null,"KULJETUS",null,null,null,null,null,null,null,"HAKKUU",null,null,"KULJETUS"]
[null,{"$f":"P$14","v":0},null,null,null,null,null,"Ohje konekustannus",null,{"$f":"Q$14","v":0},null,null,null,null,null,"Ohje konekustannus",null,null,null,null,null,null,null,null,null,null,"Ohje konekustannus"]
[]
[null,null,"valmistuksen arvo",null,"Määrä","Kuljetustyön arvo",null,"Konekustannus",null,null,"valmistuksen arvo",null,"Määrä","Kuljetustyön arvo",null,"Konekustannus",null,null,null,null,null,"valmistuksen arvo",null,"Määrä","Kuljetustyön arvo",null,"Konekustannus"]
[null,"m3","€/m3","€","m3","€/m3"," \n€","€/m3","\n€","m3","€/m3","€","m3","€/m3"," \n€","€/m3","\n€",null,null,null,"m3","€/m3","€","m3","€/m3"," \n€","€/m3","\n€"]
["Mäntykuitu",0,{"$f":"$K6","v":12.52},{"$f":"B132*C132","v":0},0,{"$f":"$L6","v":2.2200000000000002},{"$f":"E132*F132","v":0},{"$f":"$M6","v":0},{"$f":"H132*E132","v":0},0,{"$f":"$K6","v":12.52},{"$f":"J132*K132","v":0},0,{"$f":"$L6","v":2.2200000000000002},{"$f":"M132*N132","v":0},{"$f":"$M6","v":0},{"$f":"P132*M132","v":0},null,null,"MäK",0,{"$f":"$K6","v":12.52},{"$f":"U132*V132","v":0},0,{"$f":"$L6","v":2.2200000000000002},{"$f":"X132*Y132","v":0},{"$f":"$M6","v":0},{"$f":"AA132*X132","v":0}]
["Kuusikuitu",0,13.1,0,0,2.36,{"$f":"E133*F133","v":0},0,{"$f":"H133*E133","v":0},0,13.1,0,0,2.36,0,0,{"$f":"P133*M133","v":0},null,null,"KuK",0,13.1,0,0,2.36,0,0,{"$f":"AA133*X133","v":0}]
["Koivukuitu",0,11.58,0,0,2.59,0,0,0,0,11.58,0,0,2.59,0,0,0,null,null,"KoK",0,11.58,0,0,2.59,0,0,0]
["Mäntytukki",0,5.42,0,0,2.15,0,0,0,0,5.42,0,0,2.15,0,0,0,null,null,"MäT",0,5.42,0,0,2.15,0,0,0]
["Kuusitukki",0,6.98,0,0,2.17,0,0,0,0,6.98,0,0,2.17,0,0,0,null,null,"KuK",0,6.98,0,0,2.17,0,0,0]
["Koivutukki",0,5.15,0,0,2.46,0,0,0,0,5.15,0,0,2.46,0,0,0,null,null,"KoT",0,5.15,0,0,2.46,0,0,0]
["Lahopuu",0,0,0,0,0,0,0,0,0,0,0,0,0,0,0,0,null,null,"Laho",0,0,0,0,0,0,0,0]
["Erikoispuu",0,0,{"$f":"B139*C139","v":0},0,0,0,0,{"$f":"H139*E139","v":0},0,0,{"$f":"J139*K139","v":0},0,0,{"$f":"M139*N139","v":0},0,{"$f":"P139*M139","v":0},null,null,"Erikpuu",0,0,{"$f":"U139*V139","v":0},0,0,{"$f":"X139*Y139","v":0},0,{"$f":"AA139*X139","v":0}]
["Energiapuu (kokopuu)",0,7.73,{"$f":"B140*C140","v":0},0,4.05,0,0,{"$f":"H140*E140","v":0},0,7.73,{"$f":"J140*K140","v":0},0,4.05,{"$f":"M140*N140","v":0},0,{"$f":"P140*M140","v":0},null,null,"Energ.puu",0,7.73,{"$f":"U140*V140","v":0},0,4.05,{"$f":"X140*Y140","v":0},0,{"$f":"AA140*X140","v":0}]
["Halot ja klapit",0,26.26,{"$f":"B141*C141","v":0},0,2.59,0,0,{"$f":"H141*E141","v":0},0,26.26,{"$f":"J141*K141","v":0},0,2.59,{"$f":"M141*N141","v":0},0,{"$f":"P141*M141","v":0},null,null,"Halot ja klapit",0,26.26,{"$f":"U141*V141","v":0},0,2.59,{"$f":"X141*Y141","v":0},0,{"$f":"AA141*X141","v":0}]
["Haketus",0,4.0999999999999996,{"$f":"B142*C142","v":0},0," -"," -",0,{"$f":"H142*E142","v":0},0,4.0999999999999996,{"$f":"J142*K142","v":0},0," - "," -",0,{"$f":"P142*M142","v":0},null,null,"Haketus",0,4.0999999999999996,{"$f":"U142*V142","v":0},0," - "," -",0,{"$f":"AA142*X142","v":0}]
["Hake ",0," - "," - ",0,{"$f":"$L17","v":2.59},{"$f":"E143*F143","v":0},0,{"$f":"H143*E143","v":0},0," -"," -",0,{"$f":"$L17","v":2.59},{"$f":"M143*N143","v":0},0,{"$f":"P143*M143","v":0},null,null,"Hake ",0," -"," -",0,{"$f":"$L17","v":2.59},{"$f":"X143*Y143","v":0},0,{"$f":"AA143*X143","v":0}]
["Joulupuut (tukkumyynti)",null,{"$f":"$K$18","v":0},{"$f":"B144*C144","v":0},null,{"$f":"$L$18","v":0},null,{"$f":"$M$18","v":0},null,null,{"$f":"$K$18","v":0},{"$f":"J144*K144","v":0},null,{"$f":"$L$18","v":0},null,{"$f":"$M$18","v":0},null,null,null,"Joulupuu",null,{"$f":"$K$18","v":0},null,null,{"$f":"$L$18","v":0},null,{"$f":"$M$18","v":0}]
["Yhteensä",{"$f":"SUM(B132:B144)","v":0},null,{"$f":"SUM(D132:D144)","v":0},{"$f":"SUM(E132:E144)","v":0},null,{"$f":"SUM(G132:G144)","v":0},null,{"$f":"SUM(I132:I144)","v":0},{"$f":"SUM(J132:J144)","v":0},null,{"$f":"SUM(L132:L144)","v":0},{"$f":"SUM(M132:M144)","v":0},null,{"$f":"SUM(O132:O144)","v":0},null,{"$f":"SUM(Q132:Q144)","v":0},null,null,"Yhteensä",{"$f":"SUM(U132:U144)","v":0},null,{"$f":"SUM(W132:W144)","v":0},{"$f":"SUM(X132:X144)","v":0},null,{"$f":"SUM(Z132:Z144)","v":0},null,{"$f":"SUM(AB132:AB144)","v":0}]
[]
[null,"YHTEENSÄ",null,null,null,null,null,null,"Ei metsävähennystä",null,null,null,null,null,null,null,"Metsävähennykseen oikeutettujen tilojen hakkuut"]
["Hakkuutyön arvo yhteensä",{"$f":"I148+Q148","v":0},null,null,null,null,null,"Hakkuutyön arvo",{"$f":"D145","v":0},null,null,null,null,null,null,"Hakkuutyön arvo",{"$f":"L145","v":0},null,null,null,null,null,null,null,null,null,"Hakkuutyön arvo",{"$f":"W145","v":0}]
["Kuljetuksen arvo yhteensä",0,null,null,null,null,null,"Kuljetuksen arvo",{"$f":"G145","v":0},null,null,null,null,null,null,"Kuljetuksen arvo",{"$f":"O145","v":0},null,null,null,null,null,null,null,null,null,"Kuljetuksen arvo",{"$f":"Z145","v":0}]
["Konekustannus (Muuta vuosimenoa)",0,null,null,null,null,null,"Konekustannus",{"$f":"I145","v":0},null,null,null,null,null,null,"Konekustannus",{"$f":"Q145","v":0},null,null,null,null,null,null,null,null,null,"Konekustannus",{"$f":"AB145","v":0}]
["Hakkuun määrä yhteensä",0,null,null,null,null,null,"Hakkuun määrä",{"$f":"B145","v":0},null,null,null,null,null,null,"Hakkuun määrä",{"$f":"J145","v":0},null,null,null,null,null,null,null,null,null,"Hakkuun määrä",{"$f":"U145","v":0}]
["Kuljetuksen määrä yhteensä",0,null,null,null,null,null,"Kuljetuksen määrä",{"$f":"E145","v":0},null,null,null,null,null,null,"Kuljetuksen määrä",{"$f":"M145","v":0},null,null,null,null,null,null,null,null,null,"Kuljetuksen määrä",{"$f":"X145","v":0}]
["Puutavaran verollinen arvo",0,null,null,null,null,null,"Puutavaran verollinen arvo",{"$f":"(B128-I148-I149-I150)","v":0},null,null,null,null,null,null,"Metsävähennykseen oikeuttava osa (verollinen osa)",{"$f":"(J128-Q148-Q149-Q150)","v":0}]
[]
[]
["Tarkistus",null,"Hakattu määrä yhteensä",{"$f":"B151","v":0}]
[null,null,"Kuljetettu määrä yhteensä",{"$f":"B152","v":0}]
["Määrätarkistus:",{"$f":"IF(D157>D156,\"Kuljetettu määrä on valmistettua määrää suurempi\",IF(D157=D156,\"Valmistettu ja kuljetettu määrä yhtäsuuret\",\"Valmistettumääräonkuljetettuamäärääisompi\"))","v":"Valmistettu ja kuljetettu määrä yhtäsuuret"}]
[]
[]
["MAATILA 5","Maatila 5, tilat joilla ei metsävähennysoikeutta",null,null,null,null,null,null,null,"Maatila 5, tilat joilla metsävähennysoikeus",null,null,null,null,null,null,null,null,null,null,"Maatila 5, Hakkuu verovuonna - Puun myynti seuraavana vuonna. UINUMAAN JÄÄVÄ HAKKUUMÄÄRÄ"]
["Kunta:","HAKKUU",null,null,"KULJETUS",null,null,null,null,"HAKKUU",null,null,"KULJETUS",null,null,null,null,null,null,null,"HAKKUU",null,null,"KULJETUS"]
[null,{"$f":"P$15","v":0},null,null,null,null,null,"Ohje konekustannus",null,{"$f":"Q$15","v":0},null,null,null,null,null,"Ohje konekustannus",null,null,null,null,null,null,null,null,null,null,"Ohje konekustannus"]
[]
[null,null,"valmistuksen arvo",null,"Määrä","Kuljetustyön arvo",null,"Konekustannus",null,null,"valmistuksen arvo",null,"Määrä","Kuljetustyön arvo",null,"Konekustannus",null,null,null,null,null,"valmistuksen arvo",null,"Määrä","Kuljetustyön arvo",null,"Konekustannus"]
[null,"m3","€/m3","€","m3","€/m3"," \n€","€/m3","\n€","m3","€/m3","€","m3","€/m3"," \n€","€/m3","\n€",null,null,null,"m3","€/m3","€","m3","€/m3"," \n€","€/m3","\n€"]
["Mäntykuitu",0,{"$f":"$K6","v":12.52},{"$f":"B167*C167","v":0},0,{"$f":"$L6","v":2.2200000000000002},{"$f":"E167*F167","v":0},{"$f":"$M6","v":0},{"$f":"H167*E167","v":0},0,{"$f":"$K6","v":12.52},{"$f":"J167*K167","v":0},0,{"$f":"$L6","v":2.2200000000000002},{"$f":"M167*N167","v":0},{"$f":"$M6","v":0},{"$f":"P167*M167","v":0},null,null,"MäK",0,{"$f":"$K6","v":12.52},{"$f":"U167*V167","v":0},0,{"$f":"$L6","v":2.2200000000000002},{"$f":"X167*Y167","v":0},{"$f":"$M6","v":0},{"$f":"AA167*X167","v":0}]
["Kuusikuitu",0,13.1,0,0,2.36,{"$f":"E168*F168","v":0},0,{"$f":"H168*E168","v":0},0,13.1,0,0,2.36,0,0,{"$f":"P168*M168","v":0},null,null,"KuK",0,13.1,0,0,2.36,0,0,{"$f":"AA168*X168","v":0}]
["Koivukuitu",0,11.58,0,0,2.59,0,0,0,0,11.58,0,0,2.59,0,0,0,null,null,"KoK",0,11.58,0,0,2.59,0,0,0]
["Mäntytukki",0,5.42,0,0,2.15,0,0,0,0,5.42,0,0,2.15,0,0,0,null,null,"MäT",0,5.42,0,0,2.15,0,0,0]
["Kuusitukki",0,6.98,0,0,2.17,0,0,0,0,6.98,0,0,2.17,0,0,0,null,null,"KuK",0,6.98,0,0,2.17,0,0,0]
["Koivutukki",0,5.15,0,0,2.46,0,0,0,0,5.15,0,0,2.46,0,0,0,null,null,"KoT",0,5.15,0,0,2.46,0,0,0]
["Lahopuu",0,0,0,0,0,0,0,0,0,0,0,0,0,0,0,0,null,null,"Laho",0,0,0,0,0,0,0,0]
["Erikoispuu",0,0,{"$f":"B174*C174","v":0},0,0,0,0,{"$f":"H174*E174","v":0},0,0,{"$f":"J174*K174","v":0},0,0,{"$f":"M174*N174","v":0},0,{"$f":"P174*M174","v":0},null,null,"Erikpuu",0,0,{"$f":"U174*V174","v":0},0,0,{"$f":"X174*Y174","v":0},0,{"$f":"AA174*X174","v":0}]
["Energiapuu (kokopuu)",0,7.73,{"$f":"B175*C175","v":0},0,4.05,0,0,{"$f":"H175*E175","v":0},0,7.73,{"$f":"J175*K175","v":0},0,4.05,{"$f":"M175*N175","v":0},0,{"$f":"P175*M175","v":0},null,null,"Energ.puu",0,7.73,{"$f":"U175*V175","v":0},0,4.05,{"$f":"X175*Y175","v":0},0,{"$f":"AA175*X175","v":0}]
["Halot ja klapit",0,26.26,{"$f":"B176*C176","v":0},0,2.59,0,0,{"$f":"H176*E176","v":0},0,26.26,{"$f":"J176*K176","v":0},0,2.59,{"$f":"M176*N176","v":0},0,{"$f":"P176*M176","v":0},null,null,"Halot ja klapit",0,26.26,{"$f":"U176*V176","v":0},0,2.59,{"$f":"X176*Y176","v":0},0,{"$f":"AA176*X176","v":0}]
["Haketus",0,4.0999999999999996,{"$f":"B177*C177","v":0},0," -"," -",0,{"$f":"H177*E177","v":0},0,4.0999999999999996,{"$f":"J177*K177","v":0},0," - "," -",0,{"$f":"P177*M177","v":0},null,null,"Haketus",0,4.0999999999999996,{"$f":"U177*V177","v":0},0," - "," -",0,{"$f":"AA177*X177","v":0}]
["Hake ",0," - "," - ",0,{"$f":"$L17","v":2.59},{"$f":"E178*F178","v":0},0,{"$f":"H178*E178","v":0},0," -"," -",0,{"$f":"$L17","v":2.59},{"$f":"M178*N178","v":0},0,{"$f":"P178*M178","v":0},null,null,"Hake ",0," -"," -",0,{"$f":"$L17","v":2.59},{"$f":"X178*Y178","v":0},0,{"$f":"AA178*X178","v":0}]
["Joulupuut (tukkumyynti)",null,{"$f":"$K$18","v":0},{"$f":"B179*C179","v":0},null,{"$f":"$L$18","v":0},null,{"$f":"$M$18","v":0},null,null,{"$f":"$K$18","v":0},{"$f":"J179*K179","v":0},null,{"$f":"$L$18","v":0},null,{"$f":"$M$18","v":0},null,null,null,"Joulupuu",null,{"$f":"$K$18","v":0},null,null,{"$f":"$L$18","v":0},null,{"$f":"$M$18","v":0}]
["Yhteensä",{"$f":"SUM(B167:B179)","v":0},null,{"$f":"SUM(D167:D179)","v":0},{"$f":"SUM(E167:E179)","v":0},null,{"$f":"SUM(G167:G179)","v":0},null,{"$f":"SUM(I167:I179)","v":0},{"$f":"SUM(J167:J179)","v":0},null,{"$f":"SUM(L167:L179)","v":0},{"$f":"SUM(M167:M179)","v":0},null,{"$f":"SUM(O167:O179)","v":0},null,{"$f":"SUM(Q167:Q179)","v":0},null,null,"Yhteensä",{"$f":"SUM(U167:U179)","v":0},null,{"$f":"SUM(W167:W179)","v":0},{"$f":"SUM(X167:X179)","v":0},null,{"$f":"SUM(Z167:Z179)","v":0},null,{"$f":"SUM(AB167:AB179)","v":0}]
[]
[null,"YHTEENSÄ",null,null,null,null,null,null,"Ei metsävähennystä",null,null,null,null,null,null,null,"Metsävähennykseen oikeutettujen tilojen hakkuut"]
["Hakkuutyön arvo yhteensä",{"$f":"I183+Q183","v":0},null,null,null,null,null,"Hakkuutyön arvo",{"$f":"D180","v":0},null,null,null,null,null,null,"Hakkuutyön arvo",{"$f":"L180","v":0},null,null,null,null,null,null,null,null,null,"Hakkuutyön arvo",{"$f":"W180","v":0}]
["Kuljetuksen arvo yhteensä",0,null,null,null,null,null,"Kuljetuksen arvo",{"$f":"G180","v":0},null,null,null,null,null,null,"Kuljetuksen arvo",{"$f":"O180","v":0},null,null,null,null,null,null,null,null,null,"Kuljetuksen arvo",{"$f":"Z180","v":0}]
["Konekustannus (Muuta vuosimenoa)",0,null,null,null,null,null,"Konekustannus",{"$f":"I180","v":0},null,null,null,null,null,null,"Konekustannus",{"$f":"Q180","v":0},null,null,null,null,null,null,null,null,null,"Konekustannus",{"$f":"AB180","v":0}]
["Hakkuun määrä yhteensä",0,null,null,null,null,null,"Hakkuun määrä",{"$f":"B180","v":0},null,null,null,null,null,null,"Hakkuun määrä",{"$f":"J180","v":0},null,null,null,null,null,null,null,null,null,"Hakkuun määrä",{"$f":"U180","v":0}]
["Kuljetuksen määrä yhteensä",0,null,null,null,null,null,"Kuljetuksen määrä",{"$f":"E180","v":0},null,null,null,null,null,null,"Kuljetuksen määrä",{"$f":"M180","v":0},null,null,null,null,null,null,null,null,null,"Kuljetuksen määrä",{"$f":"X180","v":0}]
["Puutavaran verollinen arvo",0,null,null,null,null,null,"Puutavaran verollinen arvo",{"$f":"(B163-I183-I184-I185)","v":0},null,null,null,null,null,null,"Metsävähennykseen oikeuttava osa (verollinen osa)",{"$f":"(J163-Q183-Q184-Q185)","v":0}]
[]
[]
["Tarkistus",null,"Hakattu määrä yhteensä",{"$f":"B186","v":0}]
[null,null,"Kuljetettu määrä yhteensä",{"$f":"B187","v":0}]
["Määrätarkistus:",{"$f":"IF(D192>D191,\"Kuljetettu määrä on valmistettua määrää suurempi\",IF(D192=D191,\"Valmistettu ja kuljetettu määrä yhtäsuuret\",\"Valmistettumääräonkuljetettuamäärääisompi\"))","v":"Valmistettu ja kuljetettu määrä yhtäsuuret"}]

{"sheet":"Hank.työ 2","index":4,"n_rows":152,"n_cols":29,"rows_kept":152,"cut":false,"hidden":false,"merged":[[1,20,1,27],[7,15,9,15],[7,16,9,16],[10,8,10,9],[11,8,11,9],[1,5,1,14],[2,5,2,14],[4,8,4,9],[7,14,9,14],[3,20,3,21],[3,10,3,11],[4,20,4,21],[50,24,50,25],[12,8,12,9],[5,8,5,9],[6,8,6,9],[7,8,7,9],[8,8,8,9],[9,8,9,9],[5,20,5,21],[21,7,21,8],[22,7,22,8],[23,29,23,30],[23,31,23,32],[23,34,23,35],[6,20,6,27],[23,24,23,25],[18,20,18,27],[7,20,9,27],[23,10,23,11],[23,13,23,14],[23,15,23,16],[23,21,23,22],[17,20,17,27],[23,26,23,27],[23,53,23,54],[23,55,23,56],[23,58,23,59],[23,61,23,62],[23,63,23,64],[23,66,23,67],[23,37,23,38],[23,39,23,40],[23,42,23,43],[23,45,23,46],[23,47,23,48],[23,50,23,51],[23,138,23,139],[50,2,50,3],[50,5,50,6],[50,7,50,8],[50,10,50,11],[50,13,50,14],[50,15,50,16],[50,21,50,22],[23,101,23,102],[23,103,23,104],[23,127,23,128],[23,130,23,131],[23,133,23,134],[23,135,23,136],[23,106,23,107],[23,109,23,110],[23,111,23,112],[23,114,23,115],[23,85,23,86],[23,87,23,88],[23,90,23,91],[23,93,23,94],[23,95,23,96],[23,98,23,99],[50,47,50,48],[50,50,50,51],[50,53,50,54],[50,55,50,56],[50,58,50,59],[50,61,50,62],[23,122,23,123],[23,125,23,126],[50,26,50,27],[50,29,50,30],[50,31,50,32],[50,34,50,35],[50,37,50,38],[50,39,50,40],[50,42,50,43],[50,45,50,46],[23,117,23,118],[23,119,23,120],[23,69,23,70],[23,71,23,72],[23,74,23,75],[23,77,23,78],[23,79,23,80],[23,82,23,83],[50,135,50,136],[50,106,50,107],[50,109,50,110],[50,111,50,112],[50,114,50,115],[50,117,50,118],[50,119,50,120],[50,122,50,123],[50,63,50,64],[50,66,50,67],[50,69,50,70],[50,71,50,72],[50,101,50,102],[50,103,50,104],[50,74,50,75],[50,77,50,78],[50,79,50,80],[50,82,50,83],[50,125,50,126],[50,127,50,128],[50,130,50,131],[50,133,50,134],[50,90,50,91],[50,93,50,94],[77,130,77,131],[77,133,77,134],[77,135,77,136],[104,26,104,27],[131,21,131,22],[131,24,131,25],[131,26,131,27],[77,109,77,110],[77,111,77,112],[77,114,77,115],[77,87,77,88],[77,90,77,91],[77,61,77,62],[77,63,77,64],[77,66,77,67],[77,69,77,70],[77,71,77,72],[77,74,77,75],[77,45,77,46],[77,47,77,48],[77,125,77,126],[77,106,77,107],[77,77,77,78],[77,79,77,80],[77,82,77,83],[77,85,77,86],[50,95,50,96],[50,98,50,99],[50,85,50,86],[50,87,50,88],[77,127,77,128],[131,15,131,16],[77,117,77,118],[77,119,77,120],[77,122,77,123],[77,93,77,94],[77,95,77,96],[77,98,77,99],[77,101,77,102],[77,103,77,104],[77,29,77,30],[77,31,77,32],[77,34,77,35],[77,37,77,38],[77,39,77,40],[77,42,77,43],[77,21,77,22],[77,26,77,27],[104,24,104,25],[77,24,77,25],[77,50,77,51],[77,53,77,54],[77,55,77,56],[77,58,77,59],[77,2,77,3],[77,5,77,6],[77,7,77,8],[77,10,77,11],[77,13,77,14],[77,15,77,16],[23,2,23,3],[23,5,23,6],[131,2,131,3],[131,5,131,6],[131,7,131,8],[131,10,131,11],[131,13,131,14],[104,21,104,22],[104,2,104,3],[104,5,104,6],[104,7,104,8],[104,10,104,11],[104,13,104,14],[104,15,104,16],[23,7,23,8]]}
["Mette 2016"]
["Metsätalouden kirjanpito",null,null,null,null,{"$f":"Etusivu!C10","v":"RAJOITETTU TESTIVESIO"},null,null,null,null,null,null,null,null,null,null,null,null,null,null,{"$f":"CONCATENATE(\"Verovuodelta \",Etusivu!$B7-1,\" uinumaan jätetty hankintatyö\")","v":"Verovuodelta 2015 uinumaan jätetty hankintatyö"}]
["Hankintatyön arvon  laskenta",null,null,"Y-tunnus ",{"$f":"Etusivu!C14","v":"1322222-2"},{"$f":"Etusivu!E10","v":"Testitila 1:45"},null,null,null,null,null,null,null,null,null,"ohje",null,null,null,null,null,null,"YHTEENSÄ","Maatila 1","Maatila 2","Maatila 3","Maatila 4","Maatila 5"]
["Polttopuut ja joulupuut (1.3.)",null,null,null,null,null,null,null,null,null,"Kuljetuksen konekustan-\nnukset käytössä",null,"ei",null,null,"#### - ohje",null,null,null,null,"Hankintatyön arvo, €",null,{"$f":"SUM(X4:AB4)","v":0},null,0,0,0,0]
[null,null,"Maatila 1","Maatila 2","Maatila 3","Maatila 4","Maatila 5",null,"Täyttöoppaan taksat",null,"Valmistus","Kuljetus","Kulj. Konekust."]
["Hankintakauppatulot maatilalta",null,{"$f":"P11+Q11","v":0},{"$f":"+P12+Q12","v":0},{"$f":"+P13+Q13","v":0},{"$f":"+P14+Q14","v":0},{"$f":"+P15+Q15","v":0},"€","Energiapuu (kokopuu)",null,7.73,4.05,{"$f":"IF(M$4=\"kyllä\",N6,0)","v":0},6.08]
["Puutavaran verollinen arvo",null,{"$f":"IF(B39>=0,B39,\"- arvo tarkista\")","v":0},{"$f":"IF(B66>=0,B66,\"- arvo tarkista\")","v":0},{"$f":"IF(B93>=0,B93,\"- arvo tarkista\")","v":0},{"$f":"IF(B120>=0,B120,\"- arvo tarkista\")","v":0},{"$f":"IF(B147>=0,B147,\"- arvo tarkista\")","v":0},"€","Halot ja klapit",null,26.26,2.59,{"$f":"IF(M$4=\"kyllä\",N7,0)","v":0},3.89,"Aputaulukko: Tulot maatiloittain",null,null,null,null,null,{"$f":"CONCATENATE(\"Verovuoden \",Etusivu!$B7,\" uinumaan jäävä hankintatyö. \")","v":"Verovuoden 2016 uinumaan jäävä hankintatyö. "}]
["Konekustannusosuus (vuosimenoa)",null,{"$f":"+B36","v":0},{"$f":"+B63","v":0},{"$f":"+B90","v":0},{"$f":"+B117","v":0},{"$f":"+B144","v":0},"€","Haketus",null,4.0999999999999996,null,null,null,"Maatila","EI metsävähen- nysoikeutta","Metsävähen-nysoikeus",null,null,null,"TÄHÄN ALLE VAIN NE KUUTIOMÄÄRÄT JOTKA ON TEHTY VEROVUONNA, \nMUTTA MYYDÄÄN TULEVANA VEROVUONNA\nSiirrä seuraavan vuoden veroilmoitukseen hankintatyön arvoon (lomake 2C kohta 2.1)\")"]
["Valmistettu määrä yhteensä",null,{"$f":"+B37","v":0},{"$f":"+B64","v":0},{"$f":"B91","v":0},{"$f":"+B118","v":0},{"$f":"+B145","v":0},"m3","Hake ",null,null,2.59,{"$f":"IF(M$4=\"kyllä\",N9,0)","v":0},3.89]
["Valmistuksen arvo yhteensä",null,{"$f":"+B34","v":0},{"$f":"+B61","v":0},{"$f":"+B88","v":0},{"$f":"+B115","v":0},{"$f":"+B142","v":0},"€","Joulupuut"]
["Valmistuksen verollinen arvo (125 m3 verovapaata työtä)",null,{"$f":"IF(C9+'Hank.työ 1'!C9=0,0,IF((C9+'Hank.työ 1'!C9-125)/(C9+'Hank.työ 1'!C9)*C10>0,(C9+'Hank.työ 1'!C9-125)/(C9+'Hank.työ 1'!C9)*C10,0))","v":0},{"$f":"IF(D9+'Hank.työ 1'!D9=0,0,IF((D9+'Hank.työ 1'!D9-125)/(D9+'Hank.työ 1'!D9)*D10>0,(D9+'Hank.työ 1'!D9-125)/(D9+'Hank.työ 1'!D9)*D10,0))","v":0},{"$f":"IF(E9+'Hank.työ 1'!E9=0,0,IF((E9+'Hank.työ 1'!E9-125)/(E9+'Hank.työ 1'!E9)*E10>0,(E9+'Hank.työ 1'!E9-125)/(E9+'Hank.työ 1'!E9)*E10,0))","v":0},{"$f":"IF(F9+'Hank.työ 1'!F9=0,0,IF((F9+'Hank.työ 1'!F9-125)/(F9+'Hank.työ 1'!F9)*F10>0,(F9+'Hank.työ 1'!F9-125)/(F9+'Hank.työ 1'!F9)*F10,0))","v":0},{"$f":"IF(G9+'Hank.työ 1'!G9=0,0,IF((G9+'Hank.työ 1'!G9-125)/(G9+'Hank.työ 1'!G9)*G10>0,(G9+'Hank.työ 1'!G9-125)/(G9+'Hank.työ 1'!G9)*G10,0))","v":0},"€",null,null,null,null,null,null,1,{"$f":"Tulot!AL7","v":0},{"$f":"Tulot!AM7","v":0}]
["Kuljetuksen määrä yhteensä",null,{"$f":"+B38","v":0},{"$f":"+B65","v":0},{"$f":"+B91","v":0},{"$f":"+B118","v":0},{"$f":"+B145","v":0},"m3",null,null,null,null,null,null,2,{"$f":"Tulot!AN7","v":0},{"$f":"Tulot!AO7","v":0},null,null,null,null,null,null,"Maatila 1","Maatila 2","Maatila 3","Maatila 4","Maatila 5"]
["kuljetuksen arvo yhteensä",null,{"$f":"+B35","v":0},{"$f":"+B62","v":0},{"$f":"+B89","v":0},{"$f":"+B116","v":0},{"$f":"+B143","v":0},"€",null,null,null,null,null,null,3,{"$f":"Tulot!AP7","v":0},{"$f":"Tulot!AQ7","v":0},null,null,null,"Valmistettu määrä yhteensä",null,null,{"$f":"AB37","v":0},{"$f":"AB64","v":0},{"$f":"AB91","v":0},{"$f":"AB118","v":0},{"$f":"AB145","v":0},"m3"]
["Kuljetuksen verollinen arvo (125 m3 verovapaata työtä)",null,{"$f":"IF(C12+'Hank.työ 1'!C12=0,0,IF((C12+'Hank.työ 1'!C12-125)/(C12+'Hank.työ 1'!C12)*C13>0,(C12+'Hank.työ 1'!C12-125)/(C12+'Hank.työ 1'!C12)*C13,0))","v":0},{"$f":"IF(D12=0,0,IF((D12-125)/D12*D13>0,(D12-125)/D12*D13,0))","v":0},{"$f":"IF(E12=0,0,IF((E12-125)/E12*E13>0,(E12-125)/E12*E13,0))","v":0},{"$f":"IF(F12=0,0,IF((F12-125)/F12*F13>0,(F12-125)/F12*F13,0))","v":0},{"$f":"IF(G12=0,0,IF((G12-125)/G12*G13>0,(G12-125)/G12*G13,0))","v":0},"€",null,null,null,null,null,null,4,{"$f":"Tulot!AR7","v":0},{"$f":"Tulot!AS7","v":0},null,null,null,"Valmistuksen arvo yhteensä",null,null,{"$f":"AB34","v":0},{"$f":"AB61","v":0},{"$f":"AB88","v":0},{"$f":"AB115","v":0},{"$f":"AB142","v":0},"€"]
["Hankintatyön arvo yhteensä",null,{"$f":"C10+C13","v":0},0,0,0,0,"€",null,null,null,null,null,null,5,{"$f":"Tulot!AT7","v":0},{"$f":"Tulot!AU7","v":0},null,null,null,"Kuljetuksen määrä yhteensä",null,null,{"$f":"AB38","v":0},{"$f":"AB65","v":0},{"$f":"AB92","v":0},{"$f":"AB119","v":0},{"$f":"AB146","v":0},"m3"]
["Hankintatyön verollinen arvo yhteensä",null,0,0,0,0,0,"€",null,null,null,null,null,null,"yhteensä",{"$f":"SUM(P11:P15)","v":0},{"$f":"SUM(Q11:Q15)","v":0},null,null,null,"kuljetuksen arvo yhteensä",null,null,{"$f":"AB35","v":0},{"$f":"AB62","v":0},{"$f":"AB89","v":0},{"$f":"AB116","v":0},{"$f":"AB143","v":0},"€"]
["Hakkuumäärä yht. verovuonna (sis. hank.työ 1 ja 2)",null,{"$f":"C9+'Hank.työ 1'!C9","v":21},{"$f":"D9+'Hank.työ 1'!D9","v":0},{"$f":"E9+'Hank.työ 1'!E9","v":0},{"$f":"F9+'Hank.työ 1'!F9","v":0},{"$f":"G9+'Hank.työ 1'!G9","v":0},null,null,null,null,null,null,null,null,null,null,null,null,null,"HANKINTATYÖN ARVO YHTEENSÄ",null,null,{"$f":"X14+X16","v":0},{"$f":"Y14+Y16","v":0},{"$f":"Z14+Z16","v":0},{"$f":"AA14+AA16","v":0},{"$f":"AB14+AB16","v":0},"€"]
["Uinumaan jäävän hankintatyön laskenta oikealla sarakkeilla U - AB",null,null,null,null,null,null,null,null,null,null,null,null,null,null,null,null,null,null,null,"Siirrä nämä alarivin summat seuraavan vuoden verotukseen uinumaan jätettyinä hankintatyön arvoina."]
[]
["MAATILA 1","Maatila 1, tilat joilla ei metsävähennysoikeutta",null,null,null,null,null,null,null,"Maatila 1, tilat joilla metsävähennysoikeus",null,null,null,null,null,null,null,null,null,null,"Maatila 1, Hakkuu verovuonna - Puun myynti seuraavana vuonna. UINUMAAN JÄÄVÄ HAKKUUMÄÄRÄ"]
["Kunta:","HAKKUU",null,null,"KULJETUS",null,null,"Ohje konekustannus",null,"HAKKUU",null,null,"KULJETUS",null,null,"Ohje konekustannus",null,null,null,null,"HAKKUU",null,null,"KULJETUS",null,null,"Ohje konekustannus"]
[null,{"$f":"P$11","v":0},null,null,null,null,null,null,null,{"$f":"Q11","v":0}]
[]
[null,null,"valmistuksen arvo",null,"Määrä","Kuljetustyön arvo",null,"Konekustannus",null,null,"valmistuksen arvo",null,"Määrä","Kuljetustyön arvo",null,"Konekustannus",null,null,null,null,null,"valmistuksen arvo",null,"Määrä","Kuljetustyön arvo",null,"Konekustannus"]
[null,"m3","€/m3","€","m3","€/m3"," \n€","€/m3","\n€","m3","€/m3","€","m3","€/m3"," \n€","€/m3","\n€",null,null,null,"m3","€/m3","€","m3","€/m3"," \n€","€/m3","\n€"]
["Energiapuu (kokopuu)",0,{"$f":"$K6","v":7.73},{"$f":"B26*C26","v":0},0,{"$f":"$L6","v":4.05},{"$f":"E26*F26","v":0},{"$f":"$M6","v":0},{"$f":"H26*E26","v":0},0,{"$f":"$K6","v":7.73},{"$f":"J26*K26","v":0},0,{"$f":"      $L6","v":4.05},{"$f":"M26*N26","v":0},{"$f":"$M6","v":0},{"$f":"P26*M26","v":0},null,null,"E.puu (kokopuu)",null,{"$f":"$K6","v":7.73},{"$f":"U26*V26","v":0},null,{"$f":"      $L6","v":4.05},{"$f":"X26*Y26","v":0},{"$f":"$M6","v":0},{"$f":"AA26*X26","v":0}]
["Halot ja klapit",0,{"$f":"$K7","v":26.26},{"$f":"B27*C27","v":0},0,{"$f":"$L7","v":2.59},{"$f":"E27*F27","v":0},{"$f":"$M7","v":0},{"$f":"H27*E27","v":0},0,{"$f":"$K7","v":26.26},{"$f":"J27*K27","v":0},0,{"$f":"      $L7","v":2.59},{"$f":"M27*N27","v":0},{"$f":"$M7","v":0},{"$f":"P27*M27","v":0},null,null,"Halot ja klapit",0,{"$f":"$K7","v":26.26},{"$f":"U27*V27","v":0},0,{"$f":"      $L7","v":2.59},{"$f":"X27*Y27","v":0},{"$f":"$M7","v":0},{"$f":"AA27*X27","v":0}]
["Haketus",0,{"$f":"$K8","v":4.0999999999999996},{"$f":"B28*C28","v":0},0," -"," -",{"$f":"$M8","v":0},{"$f":"H28*E28","v":0},0,{"$f":"$K8","v":4.0999999999999996},{"$f":"J28*K28","v":0},0," - "," - ",{"$f":"$M8","v":0},{"$f":"P28*M28","v":0},null,null,"Haketus",0,{"$f":"$K8","v":4.0999999999999996},{"$f":"U28*V28","v":0},0," - "," - ",{"$f":"$M8","v":0},{"$f":"AA28*X28","v":0}]
["Hake ",0," - "," - ",0,{"$f":"$L9","v":2.59},{"$f":"E29*F29","v":0},{"$f":"$M9","v":0},{"$f":"H29*E29","v":0},0," - "," - ",0,{"$f":"      $L9","v":2.59},{"$f":"M29*N29","v":0},{"$f":"$M9","v":0},{"$f":"P29*M29","v":0},null,null,"Hake ",0," - "," - ",0,{"$f":"      $L9","v":2.59},{"$f":"X29*Y29","v":0},{"$f":"$M9","v":0},{"$f":"AA29*X29","v":0}]
["Joulupuut",0,{"$f":"$K$10","v":0},{"$f":"B30*C30","v":0},0,{"$f":"$L$10","v":0},{"$f":"E30*F30","v":0},{"$f":"$M$10","v":0},{"$f":"H30*E30","v":0},0,{"$f":"$K$10","v":0},{"$f":"J30*K30","v":0},0,{"$f":"$L$10","v":0},{"$f":"M30*N30","v":0},{"$f":"$M$10","v":0},{"$f":"P30*M30","v":0},null,null,"Joulupuut",0,{"$f":"$K$10","v":0},{"$f":"U30*V30","v":0},0,{"$f":"$L$10","v":0},{"$f":"X30*Y30","v":0},{"$f":"$M$10","v":0},{"$f":"AA30*X30","v":0}]
["Yhteensä",{"$f":"SUM(B26:B30)","v":0},null,{"$f":"SUM(D26:D30)","v":0},{"$f":"SUM(E26:E30)","v":0},null,{"$f":"SUM(G26:G30)","v":0},null,{"$f":"SUM(I26:I30)","v":0},{"$f":"SUM(J26:J30)","v":0},null,{"$f":"SUM(L26:L30)","v":0},{"$f":"SUM(M26:M30)","v":0},null,{"$f":"SUM(O26:O30)","v":0},null,{"$f":"SUM(Q26:Q30)","v":0},null,null,"Yhteensä",{"$f":"SUM(U26:U30)","v":0},null,{"$f":"SUM(W26:W30)","v":0},{"$f":"SUM(X26:X30)","v":0},null,{"$f":"SUM(Z26:Z30)","v":0},null,{"$f":"SUM(AB26:AB30)","v":0}]
[]
[null,"YHTEENSÄ",null,null,null,null,null,null,"Ei metsävähennystä",null,null,null,null,null,null,null,"Metsävähennykseen oikeutettujen tilojen hakkuut"]
["Hakkuutyön arvo",{"$f":"I34+Q34","v":0},null,null,null,null,null,"Hakkuutyön arvo",{"$f":"D31","v":0},null,null,null,null,null,null,"Hakkuutyön arvo",{"$f":"L31","v":0},null,null,null,null,null,null,null,null,null,"Hakkuutyön arvo",{"$f":"W31","v":0}]
["Kuljetuksen arvo",0,null,null,null,null,null,"Kuljetuksen arvo",{"$f":"G31","v":0},null,null,null,null,null,null,"Kuljetuksen arvo",{"$f":"O31","v":0},null,null,null,null,null,null,null,null,null,"Kuljetuksen arvo",{"$f":"Z31","v":0}]
["Konekustannus (muuta vuosimenoa)",0,null,null,null,null,null,"Konekustannus",{"$f":"I31","v":0},null,null,null,null,null,null,"Konekustannus",{"$f":"Q31","v":0},null,null,null,null,null,null,null,null,null,"Konekustannus",{"$f":"AB31","v":0}]
["Hakkuun määrä yhteensä",0,null,null,null,null,null,"Hakkuun määrä",{"$f":"B31","v":0},null,null,null,null,null,null,"Hakkuun määrä",{"$f":"J31","v":0},null,null,null,null,null,null,null,null,null,"Hakkuun määrä",{"$f":"U31","v":0}]
["Kuljetuksen määrä yhteensä",0,null,null,null,null,null,"Kuljetuksen määrä",{"$f":"E31","v":0},null,null,null,null,null,null,"Kuljetuksen määrä",{"$f":"M31","v":0},null,null,null,null,null,null,null,null,null,"Kuljetuksen määrä",{"$f":"X31","v":0}]
["Puutavaran verollinen arvo",0,null,null,null,null,null,"Puutavaran verollinen arvo",{"$f":"(B22-I34-I35-I36)","v":0},null,null,null,null,null,null,"Metsävähennykseen oikeuttava osa (verollinen osa)",{"$f":"(J22-Q34-Q35-Q36)","v":0}]
[]
[]
[null,"Hakattu määrä yhteensä",{"$f":"B37","v":0}]
[null,"Kuljetettu määrä yhteensä",{"$f":"B38","v":0}]
["Tarkistus:",{"$f":"IF(C43>C42,\"Kuljetettu määrä on valmistettua määrää suurempi\",IF(C43=C42,\"Valmistettu ja kuljetettu määrä yhtäsuuret\",\"Valmistettu määrä on kuljetettua määrää isompi\"))","v":"Valmistettu ja kuljetettu määrä yhtäsuuret"}]
[]
[]
["MAATILA 2","Maatila 2, tilat joilla ei metsävähennysoikeutta",null,null,null,null,null,null,null,"Maatila 2, tilat joilla metsävähennysoikeus",null,null,null,null,null,null,null,null,null,null,"Maatila 2, Hakkuu verovuonna - Puun myynti seuraavana vuonna. UINUMAAN JÄÄVÄ HAKKUUMÄÄRÄ"]
["Kunta:","HAKKUU",null,null,"KULJETUS",null,null,null,null,"HAKKUU",null,null,"KULJETUS",null,null,null,null,null,null,null,"HAKKUU",null,null,"KULJETUS"]
[null,{"$f":"P$12","v":0},null,null,null,null,null,"Ohje konekustannus",null,{"$f":"Q12","v":0},null,null,null,null,null,"Ohje konekustannus",null,null,null,null,null,null,null,null,null,null,"Ohje konekustannus"]
[]
[null,null,"valmistuksen arvo",null,"Määrä","Kuljetustyön arvo",null,"Konekustannus",null,null,"valmistuksen arvo",null,"Määrä","Kuljetustyön arvo",null,"Konekustannus",null,null,null,null,null,"valmistuksen arvo",null,"Määrä","Kuljetustyön arvo",null,"Konekustannus"]
[null,"m3","€/m3","€","m3","€/m3"," \n€","€/m3","\n€","m3","€/m3","€","m3","€/m3"," \n€","€/m3","\n€",null,null,null,"m3","€/m3","€","m3","€/m3"," \n€","€/m3","\n€"]
["Energiapuu (kokopuu)",0,{"$f":"$K6","v":7.73},{"$f":"B53*C53","v":0},0,{"$f":"$L6","v":4.05},{"$f":"E53*F53","v":0},{"$f":"$M6","v":0},{"$f":"H53*E53","v":0},0,{"$f":"$K6","v":7.73},{"$f":"J53*K53","v":0},0,{"$f":"$L6","v":4.05},{"$f":"M53*N53","v":0},{"$f":"$M6","v":0},{"$f":"P53*M53","v":0},null,null,"E.puu (kokopuu)",0,{"$f":"$K6","v":7.73},{"$f":"U53*V53","v":0},0,{"$f":"$L6","v":4.05},{"$f":"X53*Y53","v":0},{"$f":"$M6","v":0},{"$f":"AA53*X53","v":0}]
["Halot ja klapit",0,{"$f":"$K7","v":26.26},{"$f":"B54*C54","v":0},0,{"$f":"$L7","v":2.59},{"$f":"E54*F54","v":0},{"$f":"$M7","v":0},{"$f":"H54*E54","v":0},0,{"$f":"$K7","v":26.26},{"$f":"J54*K54","v":0},0,{"$f":"$L7","v":2.59},{"$f":"M54*N54","v":0},{"$f":"$M7","v":0},{"$f":"P54*M54","v":0},null,null,"Halot ja klapit",0,{"$f":"$K7","v":26.26},{"$f":"U54*V54","v":0},0,{"$f":"$L7","v":2.59},{"$f":"X54*Y54","v":0},{"$f":"$M7","v":0},{"$f":"AA54*X54","v":0}]
["Haketus",0,{"$f":"$K8","v":4.0999999999999996},{"$f":"B55*C55","v":0},0," -"," -",{"$f":"$M8","v":0},{"$f":"H55*E55","v":0},0,{"$f":"$K8","v":4.0999999999999996},{"$f":"J55*K55","v":0},0," - "," -",{"$f":"$M8","v":0},{"$f":"P55*M55","v":0},null,null,"Haketus",0,{"$f":"$K8","v":4.0999999999999996},{"$f":"U55*V55","v":0},0," - "," -",{"$f":"$M8","v":0},{"$f":"AA55*X55","v":0}]
["Hake ",0," - "," - ",0,{"$f":"$L9","v":2.59},{"$f":"E56*F56","v":0},{"$f":"$M9","v":0},{"$f":"H56*E56","v":0},0," -"," -",0,{"$f":"$L9","v":2.59},{"$f":"M56*N56","v":0},{"$f":"$M9","v":0},{"$f":"P56*M56","v":0},null,null,"Hake ",0," -"," -",0,{"$f":"$L9","v":2.59},{"$f":"X56*Y56","v":0},{"$f":"$M9","v":0},{"$f":"AA56*X56","v":0}]
["Joulupuut",0,{"$f":"$K$10","v":0},{"$f":"B57*C57","v":0},0,{"$f":"$L$10","v":0},{"$f":"E57*F57","v":0},{"$f":"$M$10","v":0},{"$f":"H57*E57","v":0},0,{"$f":"$K$10","v":0},{"$f":"J57*K57","v":0},0,{"$f":"$L$10","v":0},{"$f":"M57*N57","v":0},{"$f":"$M$10","v":0},{"$f":"P57*M57","v":0},null,null,"Joulupuut",0,{"$f":"$K$10","v":0},{"$f":"U57*V57","v":0},0,{"$f":"$L$10","v":0},{"$f":"X57*Y57","v":0},{"$f":"$M$10","v":0},{"$f":"AA57*X57","v":0}]
["Yhteensä",{"$f":"SUM(B53:B57)","v":0},null,{"$f":"SUM(D53:D57)","v":0},{"$f":"SUM(E53:E57)","v":0},null,{"$f":"SUM(G53:G57)","v":0},null,{"$f":"SUM(I53:I57)","v":0},{"$f":"SUM(J53:J57)","v":0},null,{"$f":"SUM(L53:L57)","v":0},{"$f":"SUM(M53:M57)","v":0},null,{"$f":"SUM(O53:O57)","v":0},null,{"$f":"SUM(Q53:Q57)","v":0},null,null,"Yhteensä",{"$f":"SUM(U53:U57)","v":0},null,{"$f":"SUM(W53:W57)","v":0},{"$f":"SUM(X53:X57)","v":0},null,{"$f":"SUM(Z53:Z57)","v":0},null,{"$f":"SUM(AB53:AB57)","v":0}]
[]
[null,"YHTEENSÄ",null,null,null,null,null,null,"Ei metsävähennystä",null,null,null,null,null,null,null,"Metsävähennykseen oikeutettujen tilojen hakkuut"]
["Hakkuutyön arvo yhteensä",{"$f":"I61+Q61","v":0},null,null,null,null,null,"Hakkuutyön arvo",{"$f":"D58","v":0},null,null,null,null,null,null,"Hakkuutyön arvo",{"$f":"L58","v":0},null,null,null,null,null,null,null,null,null,"Hakkuutyön arvo",{"$f":"W58","v":0}]
["Kuljetuksen arvo yhteensä",0,null,null,null,null,null,"Kuljetuksen arvo",{"$f":"G58","v":0},null,null,null,null,null,null,"Kuljetuksen arvo",{"$f":"O58","v":0},null,null,null,null,null,null,null,null,null,"Kuljetuksen arvo",{"$f":"Z58","v":0}]
["Konekustannus (Muuta vuosimenoa)",0,null,null,null,null,null,"Konekustannus",{"$f":"I58","v":0},null,null,null,null,null,null,"Konekustannus",{"$f":"Q58","v":0},null,null,null,null,null,null,null,null,null,"Konekustannus",{"$f":"AB58","v":0}]
["Hakkuun määrä yhteensä",0,null,null,null,null,null,"Hakkuun määrä",{"$f":"B58","v":0},null,null,null,null,null,null,"Hakkuun määrä",{"$f":"J58","v":0},null,null,null,null,null,null,null,null,null,"Hakkuun määrä",{"$f":"U58","v":0}]
["Kuljetuksen määrä yhteensä",0,null,null,null,null,null,"Kuljetuksen määrä",{"$f":"E58","v":0},null,null,null,null,null,null,"Kuljetuksen määrä",{"$f":"M58","v":0},null,null,null,null,null,null,null,null,null,"Kuljetuksen määrä",{"$f":"X58","v":0}]
["Puutavaran verollinen arvo",0,null,null,null,null,null,"Puutavaran verollinen arvo",{"$f":"(B49-I61-I62-I63)","v":0},null,null,null,null,null,null,"Metsävähennykseen oikeuttava osa (verollinen osa)",{"$f":"(J49-Q61-Q62-Q63)","v":0}]
[]
[]
["Tarkistus",null,"Hakattu määrä yhteensä",{"$f":"B64","v":0}]
[null,null,"Kuljetettu määrä yhteensä",{"$f":"B65","v":0}]
["Määrätarkistus:",{"$f":"IF(D70>D69,\"Kuljetettu määrä on valmistettua määrää suurempi\",IF(D70=D69,\"Valmistettu ja kuljetettu määrä yhtäsuuret\",\"Valmistettumääräonkuljetettuamäärääisompi\"))","v":"Valmistettu ja kuljetettu määrä yhtäsuuret"}]
[]
[]
["MAATILA 3","Maatila 3, tilat joilla ei metsävähennysoikeutta",null,null,null,null,null,null,null,"Maatila 3, tilat joilla metsävähennysoikeus",null,null,null,null,null,null,null,null,null,null,"Maatila 3, Hakkuu verovuonna - Puun myynti seuraavana vuonna. UINUMAAN JÄÄVÄ HAKKUUMÄÄRÄ"]
["Kunta:","HAKKUU",null,null,"KULJETUS",null,null,null,null,"HAKKUU",null,null,"KULJETUS",null,null,null,null,null,null,null,"HAKKUU",null,null,"KULJETUS"]
[null,{"$f":"P$13","v":0},null,null,null,null,null,"Ohje konekustannus",null,{"$f":"Q$13","v":0},null,null,null,null,null,"Ohje konekustannus",null,null,null,null,null,null,null,null,null,null,"Ohje konekustannus"]
[]
[null,null,"valmistuksen arvo",null,"Määrä","Kuljetustyön arvo",null,"Konekustannus",null,null,"valmistuksen arvo",null,"Määrä","Kuljetustyön arvo",null,"Konekustannus",null,null,null,null,null,"valmistuksen arvo",null,"Määrä","Kuljetustyön arvo",null,"Konekustannus"]
[null,"m3","€/m3","€","m3","€/m3"," \n€","€/m3","\n€","m3","€/m3","€","m3","€/m3"," \n€","€/m3","\n€",null,null,null,"m3","€/m3","€","m3","€/m3"," \n€","€/m3","\n€"]
["Energiapuu (kokopuu)",0,{"$f":"$K6","v":7.73},{"$f":"B80*C80","v":0},0,{"$f":"$L6","v":4.05},{"$f":"E80*F80","v":0},{"$f":"$M6","v":0},{"$f":"H80*E80","v":0},0,{"$f":"$K6","v":7.73},{"$f":"J80*K80","v":0},0,{"$f":"$L6","v":4.05},{"$f":"M80*N80","v":0},{"$f":"$M6","v":0},{"$f":"P80*M80","v":0},null,null,"E.puu (kokopuu)",0,{"$f":"$K6","v":7.73},{"$f":"U80*V80","v":0},0,{"$f":"$L6","v":4.05},{"$f":"X80*Y80","v":0},{"$f":"$M6","v":0},{"$f":"AA80*X80","v":0}]
["Halot ja klapit",0,{"$f":"$K7","v":26.26},{"$f":"B81*C81","v":0},0,{"$f":"$L7","v":2.59},{"$f":"E81*F81","v":0},{"$f":"$M7","v":0},{"$f":"H81*E81","v":0},0,{"$f":"$K7","v":26.26},{"$f":"J81*K81","v":0},0,{"$f":"$L7","v":2.59},{"$f":"M81*N81","v":0},{"$f":"$M7","v":0},{"$f":"P81*M81","v":0},null,null,"Halot ja klapit",0,{"$f":"$K7","v":26.26},{"$f":"U81*V81","v":0},0,{"$f":"$L7","v":2.59},{"$f":"X81*Y81","v":0},{"$f":"$M7","v":0},{"$f":"AA81*X81","v":0}]
["Haketus",0,{"$f":"$K8","v":4.0999999999999996},{"$f":"B82*C82","v":0},0," -"," -",{"$f":"$M8","v":0},{"$f":"H82*E82","v":0},0,{"$f":"$K8","v":4.0999999999999996},{"$f":"J82*K82","v":0},0," - "," -",{"$f":"$M8","v":0},{"$f":"P82*M82","v":0},null,null,"Haketus",0,{"$f":"$K8","v":4.0999999999999996},{"$f":"U82*V82","v":0},0," - "," -",{"$f":"$M8","v":0},{"$f":"AA82*X82","v":0}]
["Hake ",0," - "," - ",0,{"$f":"$L9","v":2.59},{"$f":"E83*F83","v":0},{"$f":"$M9","v":0},{"$f":"H83*E83","v":0},0," -"," -",0,{"$f":"$L9","v":2.59},{"$f":"M83*N83","v":0},{"$f":"$M9","v":0},{"$f":"P83*M83","v":0},null,null,"Hake ",0," -"," -",0,{"$f":"$L9","v":2.59},{"$f":"X83*Y83","v":0},{"$f":"$M9","v":0},{"$f":"AA83*X83","v":0}]
["Joulupuut",0,{"$f":"$K$10","v":0},{"$f":"B84*C84","v":0},0,{"$f":"$L$10","v":0},{"$f":"E84*F84","v":0},{"$f":"$M$10","v":0},{"$f":"H84*E84","v":0},0,{"$f":"$K$10","v":0},{"$f":"J84*K84","v":0},0,{"$f":"$L$10","v":0},{"$f":"M84*N84","v":0},{"$f":"$M$10","v":0},{"$f":"P84*M84","v":0},null,null,"Joulupuut",0,{"$f":"$K$10","v":0},{"$f":"U84*V84","v":0},0,{"$f":"$L$10","v":0},{"$f":"X84*Y84","v":0},{"$f":"$M$10","v":0},{"$f":"AA84*X84","v":0}]
["Yhteensä",{"$f":"SUM(B80:B84)","v":0},null,{"$f":"SUM(D80:D84)","v":0},{"$f":"SUM(E80:E84)","v":0},null,{"$f":"SUM(G80:G84)","v":0},null,{"$f":"SUM(I80:I84)","v":0},{"$f":"SUM(J80:J84)","v":0},null,{"$f":"SUM(L80:L84)","v":0},{"$f":"SUM(M80:M84)","v":0},null,{"$f":"SUM(O80:O83)","v":0},null,{"$f":"SUM(Q80:Q84)","v":0},null,null,"Yhteensä",{"$f":"SUM(U80:U84)","v":0},null,{"$f":"SUM(W80:W84)","v":0},{"$f":"SUM(X80:X84)","v":0},null,{"$f":"SUM(Z80:Z83)","v":0},null,{"$f":"SUM(AB80:AB84)","v":0}]
[]
[null,"YHTEENSÄ",null,null,null,null,null,null,"Ei metsävähennystä",null,null,null,null,null,null,null,"Metsävähennykseen oikeutettujen tilojen hakkuut"]
["Hakkuutyön arvo yhteensä",{"$f":"I88+Q88","v":0},null,null,null,null,null,"Hakkuutyön arvo",{"$f":"D85","v":0},null,null,null,null,null,null,"Hakkuutyön arvo",{"$f":"L85","v":0},null,null,null,null,null,null,null,null,null,"Hakkuutyön arvo",{"$f":"W85","v":0}]
["Kuljetuksen arvo yhteensä",0,null,null,null,null,null,"Kuljetuksen arvo",{"$f":"G85","v":0},null,null,null,null,null,null,"Kuljetuksen arvo",{"$f":"O85","v":0},null,null,null,null,null,null,null,null,null,"Kuljetuksen arvo",{"$f":"Z85","v":0}]
["Konekustannus (Muuta vuosimenoa)",0,null,null,null,null,null,"Konekustannus",{"$f":"I85","v":0},null,null,null,null,null,null,"Konekustannus",{"$f":"Q85","v":0},null,null,null,null,null,null,null,null,null,"Konekustannus",{"$f":"AB85","v":0}]
["Hakkuun määrä yhteensä",0,null,null,null,null,null,"Hakkuun määrä",{"$f":"B85","v":0},null,null,null,null,null,null,"Hakkuun määrä",{"$f":"J85","v":0},null,null,null,null,null,null,null,null,null,"Hakkuun määrä",{"$f":"U85","v":0}]
["Kuljetuksen määrä yhteensä",0,null,null,null,null,null,"Kuljetuksen määrä",{"$f":"E85","v":0},null,null,null,null,null,null,"Kuljetuksen määrä",{"$f":"M85","v":0},null,null,null,null,null,null,null,null,null,"Kuljetuksen määrä",{"$f":"X85","v":0}]
["Puutavaran verollinen arvo",0,null,null,null,null,null,"Puutavaran verollinen arvo",{"$f":"(B76-I88-I89-I90)","v":0},null,null,null,null,null,null,"Metsävähennykseen oikeuttava osa (verollinen osa)",{"$f":"(J76-Q88-Q89-Q90)","v":0}]
[]
[]
["Tarkistus",null,"Hakattu määrä yhteensä",{"$f":"B91","v":0}]
[null,null,"Kuljetettu määrä yhteensä",{"$f":"B92","v":0}]
["Määrätarkistus:",{"$f":"IF(D97>D96,\"Kuljetettu määrä on valmistettua määrää suurempi\",IF(D97=D96,\"Valmistettu ja kuljetettu määrä yhtäsuuret\",\"Valmistettumääräonkuljetettuamäärääisompi\"))","v":"Valmistettu ja kuljetettu määrä yhtäsuuret"}]
[]
[]
["MAATILA 4","Maatila 4, tilat joilla ei metsävähennysoikeutta",null,null,null,null,null,null,null,"Maatila 4, tilat joilla metsävähennysoikeus",null,null,null,null,null,null,null,null,null,null,"Maatila 4, Hakkuu verovuonna - Puun myynti seuraavana vuonna. UINUMAAN JÄÄVÄ HAKKUUMÄÄRÄ"]
["Kunta:","HAKKUU",null,null,"KULJETUS",null,null,null,null,"HAKKUU",null,null,"KULJETUS",null,null,null,null,null,null,null,"HAKKUU",null,null,"KULJETUS"]
[null,{"$f":"P$14","v":0},null,null,null,null,null,"Ohje konekustannus",null,{"$f":"Q$14","v":0},null,null,null,null,null,"Ohje konekustannus",null,null,null,null,null,null,null,null,null,null,"Ohje konekustannus"]
[]
[null,null,"valmistuksen arvo",null,"Määrä","Kuljetustyön arvo",null,"Konekustannus",null,null,"valmistuksen arvo",null,"Määrä","Kuljetustyön arvo",null,"Konekustannus",null,null,null,null,null,"valmistuksen arvo",null,"Määrä","Kuljetustyön arvo",null,"Konekustannus"]
[null,"m3","€/m3","€","m3","€/m3"," \n€","€/m3","\n€","m3","€/m3","€","m3","€/m3"," \n€","€/m3","\n€",null,null,null,"m3","€/m3","€","m3","€/m3"," \n€","€/m3","\n€"]
["Energiapuu (kokopuu)",0,{"$f":"$K6","v":7.73},{"$f":"B107*C107","v":0},0,{"$f":"$L6","v":4.05},{"$f":"E107*F107","v":0},{"$f":"$M6","v":0},{"$f":"H107*E107","v":0},0,{"$f":"$K6","v":7.73},{"$f":"J107*K107","v":0},0,{"$f":"$L6","v":4.05},{"$f":"M107*N107","v":0},{"$f":"$M6","v":0},{"$f":"P107*M107","v":0},null,null,"E.puu (kokopuu)",0,{"$f":"$K6","v":7.73},{"$f":"U107*V107","v":0},0,{"$f":"$L6","v":4.05},{"$f":"X107*Y107","v":0},{"$f":"$M6","v":0},{"$f":"AA107*X107","v":0}]
["Halot ja klapit",0,{"$f":"$K7","v":26.26},{"$f":"B108*C108","v":0},0,{"$f":"$L7","v":2.59},{"$f":"E108*F108","v":0},{"$f":"$M7","v":0},{"$f":"H108*E108","v":0},0,{"$f":"$K7","v":26.26},{"$f":"J108*K108","v":0},0,{"$f":"$L7","v":2.59},{"$f":"M108*N108","v":0},{"$f":"$M7","v":0},{"$f":"P108*M108","v":0},null,null,"Halot ja klapit",0,{"$f":"$K7","v":26.26},{"$f":"U108*V108","v":0},0,{"$f":"$L7","v":2.59},{"$f":"X108*Y108","v":0},{"$f":"$M7","v":0},{"$f":"AA108*X108","v":0}]
["Haketus",0,{"$f":"$K8","v":4.0999999999999996},{"$f":"B109*C109","v":0},0," -"," -",{"$f":"$M8","v":0},{"$f":"H109*E109","v":0},0,{"$f":"$K8","v":4.0999999999999996},{"$f":"J109*K109","v":0},0," - "," -",{"$f":"$M8","v":0},{"$f":"P109*M109","v":0},null,null,"Haketus",0,{"$f":"$K8","v":4.0999999999999996},{"$f":"U109*V109","v":0},0," - "," -",{"$f":"$M8","v":0},{"$f":"AA109*X109","v":0}]
["Hake ",0," - "," - ",0,{"$f":"$L9","v":2.59},{"$f":"E110*F110","v":0},{"$f":"$M9","v":0},{"$f":"H110*E110","v":0},0," -"," -",0,{"$f":"$L9","v":2.59},{"$f":"M110*N110","v":0},{"$f":"$M9","v":0},{"$f":"P110*M110","v":0},null,null,"Hake ",0," -"," -",0,{"$f":"$L9","v":2.59},{"$f":"X110*Y110","v":0},{"$f":"$M9","v":0},{"$f":"AA110*X110","v":0}]
["Joulupuut",0,{"$f":"$K$10","v":0},{"$f":"B111*C111","v":0},0,{"$f":"$L$10","v":0},{"$f":"E111*F111","v":0},{"$f":"$M$10","v":0},{"$f":"H111*E111","v":0},0,{"$f":"$K$10","v":0},{"$f":"J111*K111","v":0},0,{"$f":"$L$10","v":0},{"$f":"M111*N111","v":0},{"$f":"$M$10","v":0},{"$f":"P111*M111","v":0},null,null,"Joulupuut",0,{"$f":"$K$10","v":0},{"$f":"U111*V111","v":0},0,{"$f":"$L$10","v":0},{"$f":"X111*Y111","v":0},{"$f":"$M$10","v":0},{"$f":"AA111*X111","v":0}]
["Yhteensä",{"$f":"SUM(B107:B111)","v":0},null,{"$f":"SUM(D107:D111)","v":0},{"$f":"SUM(E107:E111)","v":0},null,{"$f":"SUM(G107:G111)","v":0},null,{"$f":"SUM(I107:I111)","v":0},{"$f":"SUM(J107:J111)","v":0},null,{"$f":"SUM(L107:L111)","v":0},{"$f":"SUM(M107:M111)","v":0},null,{"$f":"SUM(O107:O111)","v":0},null,{"$f":"SUM(Q107:Q111)","v":0},null,null,"Yhteensä",{"$f":"SUM(U107:U111)","v":0},null,{"$f":"SUM(W107:W111)","v":0},{"$f":"SUM(X107:X111)","v":0},null,{"$f":"SUM(Z107:Z111)","v":0},null,{"$f":"SUM(AB107:AB111)","v":0}]
[]
[null,"YHTEENSÄ",null,null,null,null,null,null,"Ei metsävähennystä",null,null,null,null,null,null,null,"Metsävähennykseen oikeutettujen tilojen hakkuut"]
["Hakkuutyön arvo yhteensä",{"$f":"I115+Q115","v":0},null,null,null,null,null,"Hakkuutyön arvo",{"$f":"D112","v":0},null,null,null,null,null,null,"Hakkuutyön arvo",{"$f":"L112","v":0},null,null,null,null,null,null,null,null,null,"Hakkuutyön arvo",{"$f":"W112","v":0}]
["Kuljetuksen arvo yhteensä",0,null,null,null,null,null,"Kuljetuksen arvo",{"$f":"G112","v":0},null,null,null,null,null,null,"Kuljetuksen arvo",{"$f":"O112","v":0},null,null,null,null,null,null,null,null,null,"Kuljetuksen arvo",{"$f":"Z112","v":0}]
["Konekustannus (Muuta vuosimenoa)",0,null,null,null,null,null,"Konekustannus",{"$f":"I112","v":0},null,null,null,null,null,null,"Konekustannus",{"$f":"Q112","v":0},null,null,null,null,null,null,null,null,null,"Konekustannus",{"$f":"AB112","v":0}]
["Hakkuun määrä yhteensä",0,null,null,null,null,null,"Hakkuun määrä",{"$f":"B112","v":0},null,null,null,null,null,null,"Hakkuun määrä",{"$f":"J112","v":0},null,null,null,null,null,null,null,null,null,"Hakkuun määrä",{"$f":"U112","v":0}]
["Kuljetuksen määrä yhteensä",0,null,null,null,null,null,"Kuljetuksen määrä",{"$f":"E112","v":0},null,null,null,null,null,null,"Kuljetuksen määrä",{"$f":"M112","v":0},null,null,null,null,null,null,null,null,null,"Kuljetuksen määrä",{"$f":"X112","v":0}]
["Puutavaran verollinen arvo",0,null,null,null,null,null,"Puutavaran verollinen arvo",{"$f":"(B103-I115-I116-I117)","v":0},null,null,null,null,null,null,"Metsävähennykseen oikeuttava osa (verollinen osa)",{"$f":"(J103-Q115-Q116-Q117)","v":0}]
[]
[]
["Tarkistus",null,"Hakattu määrä yhteensä",{"$f":"B118","v":0}]
[null,null,"Kuljetettu määrä yhteensä",{"$f":"B119","v":0}]
["Määrätarkistus:",{"$f":"IF(D124>D123,\"Kuljetettu määrä on valmistettua määrää suurempi\",IF(D124=D123,\"Valmistettu ja kuljetettu määrä yhtäsuuret\",\"Valmistettumääräonkuljetettuamäärääisompi\"))","v":"Valmistettu ja kuljetettu määrä yhtäsuuret"}]
[]
[]
["MAATILA 5","Maatila 5, tilat joilla ei metsävähennysoikeutta",null,null,null,null,null,null,null,"Maatila 5, tilat joilla metsävähennysoikeus",null,null,null,null,null,null,null,null,null,null,"Maatila 5, Hakkuu verovuonna - Puun myynti seuraavana vuonna. UINUMAAN JÄÄVÄ HAKKUUMÄÄRÄ"]
["Kunta:","HAKKUU",null,null,"KULJETUS",null,null,null,null,"HAKKUU",null,null,"KULJETUS",null,null,null,null,null,null,null,"HAKKUU",null,null,"KULJETUS"]
[null,{"$f":"P$15","v":0},null,null,null,null,null,"Ohje konekustannus",null,{"$f":"Q$15","v":0},null,null,null,null,null,"Ohje konekustannus",null,null,null,null,null,null,null,null,null,null,"Ohje konekustannus"]
[]
[null,null,"valmistuksen arvo",null,"Määrä","Kuljetustyön arvo",null,"Konekustannus",null,null,"valmistuksen arvo",null,"Määrä","Kuljetustyön arvo",null,"Konekustannus",null,null,null,null,null,"valmistuksen arvo",null,"Määrä","Kuljetustyön arvo",null,"Konekustannus"]
[null,"m3","€/m3","€","m3","€/m3"," \n€","€/m3","\n€","m3","€/m3","€","m3","€/m3"," \n€","€/m3","\n€",null,null,null,"m3","€/m3","€","m3","€/m3"," \n€","€/m3","\n€"]
["Energiapuu (kokopuu)",0,{"$f":"$K6","v":7.73},{"$f":"B134*C134","v":0},0,{"$f":"$L6","v":4.05},{"$f":"E134*F134","v":0},{"$f":"$M6","v":0},{"$f":"H134*E134","v":0},0,{"$f":"$K6","v":7.73},{"$f":"J134*K134","v":0},0,{"$f":"$L6","v":4.05},{"$f":"M134*N134","v":0},{"$f":"$M6","v":0},{"$f":"P134*M134","v":0},null,null,"E.puu (kokopuu)",0,{"$f":"$K6","v":7.73},{"$f":"U134*V134","v":0},0,{"$f":"$L6","v":4.05},{"$f":"X134*Y134","v":0},{"$f":"$M6","v":0},{"$f":"AA134*X134","v":0}]
["Halot ja klapit",0,{"$f":"$K7","v":26.26},{"$f":"B135*C135","v":0},0,{"$f":"$L7","v":2.59},{"$f":"E135*F135","v":0},{"$f":"$M7","v":0},{"$f":"H135*E135","v":0},0,{"$f":"$K7","v":26.26},{"$f":"J135*K135","v":0},0,{"$f":"$L7","v":2.59},{"$f":"M135*N135","v":0},{"$f":"$M7","v":0},{"$f":"P135*M135","v":0},null,null,"Halot ja klapit",0,{"$f":"$K7","v":26.26},{"$f":"U135*V135","v":0},0,{"$f":"$L7","v":2.59},{"$f":"X135*Y135","v":0},{"$f":"$M7","v":0},{"$f":"AA135*X135","v":0}]
["Haketus",0,{"$f":"$K8","v":4.0999999999999996},{"$f":"B136*C136","v":0},0," -"," -",{"$f":"$M8","v":0},{"$f":"H136*E136","v":0},0,{"$f":"$K8","v":4.0999999999999996},{"$f":"J136*K136","v":0},0," - "," -",{"$f":"$M8","v":0},{"$f":"P136*M136","v":0},null,null,"Haketus",0,{"$f":"$K8","v":4.0999999999999996},{"$f":"U136*V136","v":0},0," - "," -",{"$f":"$M8","v":0},{"$f":"AA136*X136","v":0}]
["Hake ",0," - "," - ",0,{"$f":"$L9","v":2.59},{"$f":"E137*F137","v":0},{"$f":"$M9","v":0},{"$f":"H137*E137","v":0},0," -"," -",0,{"$f":"$L9","v":2.59},{"$f":"M137*N137","v":0},{"$f":"$M9","v":0},{"$f":"P137*M137","v":0},null,null,"Hake ",0," -"," -",0,{"$f":"$L9","v":2.59},{"$f":"X137*Y137","v":0},{"$f":"$M9","v":0},{"$f":"AA137*X137","v":0}]
["Joulupuut",0,{"$f":"$K$10","v":0},{"$f":"B138*C138","v":0},0,{"$f":"$L$10","v":0},{"$f":"E138*F138","v":0},{"$f":"$M$10","v":0},{"$f":"H138*E138","v":0},0,{"$f":"$K$10","v":0},{"$f":"J138*K138","v":0},0,{"$f":"$L$10","v":0},{"$f":"M138*N138","v":0},{"$f":"$M$10","v":0},{"$f":"P138*M138","v":0},null,null,"Joulupuut",0,{"$f":"$K$10","v":0},{"$f":"U138*V138","v":0},0,{"$f":"$L$10","v":0},{"$f":"X138*Y138","v":0},{"$f":"$M$10","v":0},{"$f":"AA138*X138","v":0}]
["Yhteensä",{"$f":"SUM(B134:B138)","v":0},null,{"$f":"SUM(D134:D138)","v":0},{"$f":"SUM(E134:E138)","v":0},null,{"$f":"SUM(G134:G138)","v":0},null,{"$f":"SUM(I134:I138)","v":0},{"$f":"SUM(J134:J138)","v":0},null,{"$f":"SUM(L134:L138)","v":0},{"$f":"SUM(M134:M138)","v":0},null,{"$f":"SUM(O134:O138)","v":0},null,{"$f":"SUM(Q134:Q138)","v":0},null,null,"Yhteensä",{"$f":"SUM(U134:U138)","v":0},null,{"$f":"SUM(W134:W138)","v":0},{"$f":"SUM(X134:X138)","v":0},null,{"$f":"SUM(Z134:Z138)","v":0},null,{"$f":"SUM(AB134:AB138)","v":0}]
[]
[null,"YHTEENSÄ",null,null,null,null,null,null,"Ei metsävähennystä",null,null,null,null,null,null,null,"Metsävähennykseen oikeutettujen tilojen hakkuut"]
["Hakkuutyön arvo yhteensä",{"$f":"I142+Q142","v":0},null,null,null,null,null,"Hakkuutyön arvo",{"$f":"D139","v":0},null,null,null,null,null,null,"Hakkuutyön arvo",{"$f":"L139","v":0},null,null,null,null,null,null,null,null,null,"Hakkuutyön arvo",{"$f":"W139","v":0}]
["Kuljetuksen arvo yhteensä",0,null,null,null,null,null,"Kuljetuksen arvo",{"$f":"G139","v":0},null,null,null,null,null,null,"Kuljetuksen arvo",{"$f":"O139","v":0},null,null,null,null,null,null,null,null,null,"Kuljetuksen arvo",{"$f":"Z139","v":0}]
["Konekustannus (Muuta vuosimenoa)",0,null,null,null,null,null,"Konekustannus",{"$f":"I139","v":0},null,null,null,null,null,null,"Konekustannus",{"$f":"Q139","v":0},null,null,null,null,null,null,null,null,null,"Konekustannus",{"$f":"AB139","v":0}]
["Hakkuun määrä yhteensä",0,null,null,null,null,null,"Hakkuun määrä",{"$f":"B139","v":0},null,null,null,null,null,null,"Hakkuun määrä",{"$f":"J139","v":0},null,null,null,null,null,null,null,null,null,"Hakkuun määrä",{"$f":"U139","v":0}]
["Kuljetuksen määrä yhteensä",0,null,null,null,null,null,"Kuljetuksen määrä",{"$f":"E139","v":0},null,null,null,null,null,null,"Kuljetuksen määrä",{"$f":"M139","v":0},null,null,null,null,null,null,null,null,null,"Kuljetuksen määrä",{"$f":"X139","v":0}]
["Puutavaran verollinen arvo",0,null,null,null,null,null,"Puutavaran verollinen arvo",{"$f":"(B130-I142-I143-I144)","v":0},null,null,null,null,null,null,"Metsävähennykseen oikeuttava osa (verollinen osa)",{"$f":"(J130-Q142-Q143-Q144)","v":0}]
[]
[]
["Tarkistus",null,"Hakattu määrä yhteensä",{"$f":"B145","v":0}]
[null,null,"Kuljetettu määrä yhteensä",{"$f":"B146","v":0}]
["Määrätarkistus:",{"$f":"IF(D151>D150,\"Kuljetettu määrä on valmistettua määrää suurempi\",IF(D151=D150,\"Valmistettu ja kuljetettu määrä yhtäsuuret\",\"Valmistettumääräonkuljetettuamäärääisompi\"))","v":"Valmistettu ja kuljetettu määrä yhtäsuuret"}]

{"sheet":"Menot","index":5,"n_rows":232,"n_cols":29,"rows_kept":232,"cut":false,"hidden":false,"merged":[[1,5,1,20],[2,5,2,20],[4,23,4,25],[7,0,7,3],[3,23,3,25],[4,1,4,2],[4,10,4,12],[4,13,4,19],[5,13,5,14],[3,7,3,9],[4,6,5,6],[8,0,8,3],[9,0,9,3],[10,16,10,18],[10,13,10,15],[10,19,10,21]]}
["Mette 2016"]
["Metsätalouden kirjanpito",null,null,null,null,{"$f":"Etusivu!C10","v":"RAJOITETTU TESTIVESIO"}]
["Menot",null,null,"OHJE ","OHJE ",{"$f":"Etusivu!E10","v":"Testitila 1:45"}]
[null,null,null,null,null,null,null,{"$f":"IF(Etusivu!$C$20=\"kyllä\",\"Arvonlisäverovelvollinen\",\"Ei arvonlisäverovelvollinen\")","v":"Arvonlisäverovelvollinen"},null,null,null,null,null,null,null,null,null,null,null,null,null,null,null,"Jos erittelet metsätalouden osuuden tässä, \nKäytä sarakkeella G 100%",null,null,"Valikkoarvot"]
["Kuitti","Päiväys",null,null,"Menoluokka","Koko summa","Metsä-talouden osuus","ALV:n osuus","Vähennys- kelpoinen","Väh.kelp. summa ","Vuosimenot",null,null,"Poistot (alv 0 %)",null,null,null,null,null,null,null,null,null,"Muistiinpanoihin sisältyvät \nmuun toiminnan menot (alv 0%)",null,null,1,"Palkat",0.24]
["N:o","pv","kk"," Selite",null,"sis. alv",null,"alv-%","alv €","alv 0 %","Palkat","Matkat","Muut","koneet",null,null,"rakennukset",null,null,"ojat, tiet",null,null,null,"Maatalous","Elinkeinotoiminta","Yksityismenot",2,"Matkat",0.1]
["YHTEENSÄ",null,null,null,null,{"$f":"SUM(F12:F232)","v":3789.9},null,null,{"$f":"SUM(I9:I232)","v":704.46},{"$f":"SUM(J12:J232)","v":2870.07},{"$f":"SUM(K12:K232)","v":0},{"$f":"SUM(L8:L232)","v":31.44},{"$f":"SUM(M9:M232)","v":575.67999999999995},{"$f":"SUM(N12:N232)","v":629.03},null,null,{"$f":"SUM(Q12:Q232)","v":0},null,null,{"$f":"SUM(T12:T232)","v":1935.48},null,null,null,{"$f":"SUM(X12:X232)","v":0},{"$f":"SUM(Y12:Y232)","v":0},{"$f":"SUM(Z12:Z232)","v":0},3,"Muut",0]
["Vuoden matkakulut ajopäiväkirjasta",null,null,null,null,null,null,null,null,null,null,{"$f":"Ajopäiv.!K6","v":31.44},null,null,null,null,null,null,null,null,null,null,null,null,null,null,4,"Konepoisto"]
["Arvionvaraiset",null,null,null,null,null,null,null,{"$f":"Arvionvaraiset!G34","v":15.63},null,null,null,{"$f":"Arvionvaraiset!G35","v":270.12},null,null,null,null,null,null,null,null,null,null,null,null,null,5,"Rak.poisto"]
["Hankintatyön konekustannusosuus",null,null,null,null,null,null,null,null,null,null,null,{"$f":"SUM('Hank.työ 1'!C8:G8)+SUM('Hank.työ 2'!C8:G8)","v":0},null,null,null,null,null,null,null,null,null,null,null,null,null,6,"Oja/tie poisto"]
[null,null,null,null,null,null,null,null,null,null,"Palkat","Matkat","Muut","Konepoisto",null,null,"Rak.poisto",null,null,"Oja/tie poisto"]
[200,8,9,"Mette kirjanpito-ohjelman käyttömaksu","Muut",39.9,1,0.24,{"$f":"G12*((F12-(X12+Y12+Z12)*(1+H12))-((F12-(X12+Y12+Z12)*(1+H12))/(1+H12)))","v":7.72},{"$f":"G12*(F12/(1+H12))","v":32.18},{"$f":"IF($E12=K$11,$J12,0)-IF(E12=K$11,SUM(X12:Z12),0)","v":0},{"$f":"IF($E12=L$11,$J12,0)-IF(E12=L$11,SUM(X12:Z12),0)","v":0},{"$f":"IF($E12=M$11,$J12,0)-IF(E12=M$11,SUM(X12:Z12),0)","v":32.18},{"$f":"IF($E12=N$11,$J12,0)-IF(E12=N$11,SUM(X12:Z12),0)","v":0},null,{"$f":"IF(N12>0,IF(O12<1,\" !\",\"\"),\"\")","v":""},{"$f":"IF($E12=Q$11,$J12,0)-IF(E12=Q$11,SUM(X12:Z12),0)","v":0},null,{"$f":"IF(Q12>0,IF(R12<1,\" !\",\"\"),\"\")","v":""},{"$f":"IF($E12=T$11,$J12,0)-IF(E12=T$11,SUM(X12:Z12),0)","v":0},null,{"$f":"IF(T12>0,IF(U12<1,\" !\",\"\"),\"\")","v":""}]
[201,3,3,"Raivaussahan bensaa","Muut",50,1,{"$f":"IF(Etusivu!$C$20=\"kyllä\",24%,0%)","v":0.24},{"$f":"G13*((F13-(X13+Y13+Z13)*(1+H13))-((F13-(X13+Y13+Z13)*(1+H13))/(1+H13)))","v":9.68},{"$f":"G13*(F13/(1+H13))","v":40.32},0,0,40.32,0,null,{"$f":"IF(N13>0,IF(O13<1,\" !\",\"\"),\"\")","v":""},0,null,{"$f":"IF(Q13>0,IF(R13<1,\" !\",\"\"),\"\")","v":""},0,null,{"$f":"IF(T13>0,IF(U13<1,\" !\",\"\"),\"\")","v":""}]
[202,null,null,null,null,null,1,{"$f":"IF(Etusivu!$C$20=\"kyllä\",24%,0%)","v":0.24},{"$f":"G14*((F14-(X14+Y14+Z14)*(1+H14))-((F14-(X14+Y14+Z14)*(1+H14))/(1+H14)))","v":0},{"$f":"G14*(F14/(1+H14))","v":0},0,0,0,0,null,{"$f":"IF(N14>0,IF(O14<1,\" !\",\"\"),\"\")","v":""},0,null,{"$f":"IF(Q14>0,IF(R14<1,\" !\",\"\"),\"\")","v":""},0,null,{"$f":"IF(T14>0,IF(U14<1,\" !\",\"\"),\"\")","v":""}]
[203,null,null,"Kolme ylintää on auki testailua varten",null,null,1,{"$f":"IF(Etusivu!$C$20=\"kyllä\",24%,0%)","v":0.24},0,0,0,0,0,0,null,"",0,null,"",0,null,""]
[204,4,4,"Metsätien peruskorjaus, Peräkyläntie","Oja/tie poisto",2400,1,{"$f":"IF(Etusivu!$C$20=\"kyllä\",24%,0%)","v":0.24},464.52,1935.48,0,0,0,0,null,"",0,null,"",1935.48,1,""]
[205,5,5,"raivaussaha","Konepoisto",780,1,{"$f":"IF(Etusivu!$C$20=\"kyllä\",24%,0%)","v":0.24},150.97,629.03,0,0,0,629.03,2,"",0,null,"",0,null,""]
[206,6,7,"työhanskat","Muut",10,1,{"$f":"IF(Etusivu!$C$20=\"kyllä\",24%,0%)","v":0.24},1.94,8.06,0,0,8.06,0,null,"",0,null,"",0,null,""]
[207,8,9,"Tietokone Osittain yksityiskäyttö","Muut",390,0.5,{"$f":"IF(Etusivu!$C$20=\"kyllä\",24%,0%)","v":0.24},37.74,157.26,0,0,157.26,0,null,"",0,null,"",0,null,""]
[208,8,9,"Excel, Metten käyttöä varten","Muut",120,0.7,{"$f":"IF(Etusivu!$C$20=\"kyllä\",24%,0%)","v":0.24},16.260000000000002,67.739999999999995,0,0,67.739999999999995,0,null,"",0,null,"",0,null,""]
[209,null,null,null,null,null,1,{"$f":"IF(Etusivu!$C$20=\"kyllä\",24%,0%)","v":0.24},0,0,0,0,0,0,null,"",0,null,"",0,null,""]
[210,null,null,null,null,null,1,{"$f":"IF(Etusivu!$C$20=\"kyllä\",24%,0%)","v":0.24},0,0,0,0,0,0,null,"",0,null,"",0,null,""]
[211,null,null,null,null,null,1,{"$f":"IF(Etusivu!$C$20=\"kyllä\",24%,0%)","v":0.24},0,0,0,0,0,0,null,"",0,null,"",0,null,""]
[212,null,null,null,null,null,1,{"$f":"IF(Etusivu!$C$20=\"kyllä\",24%,0%)","v":0.24},0,0,0,0,0,0,null,"",0,null,"",0,null,""]
[213,null,null,null,null,null,1,{"$f":"IF(Etusivu!$C$20=\"kyllä\",24%,0%)","v":0.24},0,0,0,0,0,0,null,"",0,null,"",0,null,""]
[214,null,null,null,null,null,1,{"$f":"IF(Etusivu!$C$20=\"kyllä\",24%,0%)","v":0.24},0,0,0,0,0,0,null,"",0,null,"",0,null,""]
[215,null,null,null,null,null,1,{"$f":"IF(Etusivu!$C$20=\"kyllä\",24%,0%)","v":0.24},0,0,0,0,0,0,null,"",0,null,"",0,null,""]
[216,null,null,null,null,null,1,{"$f":"IF(Etusivu!$C$20=\"kyllä\",24%,0%)","v":0.24},0,0,0,0,0,0,null,"",0,null,"",0,null,""]
[217,null,null,null,null,null,1,{"$f":"IF(Etusivu!$C$20=\"kyllä\",24%,0%)","v":0.24},0,0,0,0,0,0,null,"",0,null,"",0,null,""]
[218,null,null,null,null,null,1,{"$f":"IF(Etusivu!$C$20=\"kyllä\",24%,0%)","v":0.24},0,0,0,0,0,0,null,"",0,null,"",0,null,""]
[219,null,null,null,null,null,1,{"$f":"IF(Etusivu!$C$20=\"kyllä\",24%,0%)","v":0.24},0,0,0,0,0,0,null,"",0,null,"",0,null,""]
[220,null,null,null,null,null,1,{"$f":"IF(Etusivu!$C$20=\"kyllä\",24%,0%)","v":0.24},0,0,0,0,0,0,null,"",0,null,"",0,null,""]
[221,null,null,null,null,null,1,{"$f":"IF(Etusivu!$C$20=\"kyllä\",24%,0%)","v":0.24},0,0,0,0,0,0,null,"",0,null,"",0,null,""]
[222,null,null,null,null,null,1,{"$f":"IF(Etusivu!$C$20=\"kyllä\",24%,0%)","v":0.24},0,0,0,0,0,0,null,"",0,null,"",0,null,""]
[223,null,null,null,null,null,1,{"$f":"IF(Etusivu!$C$20=\"kyllä\",24%,0%)","v":0.24},0,0,0,0,0,0,null,"",0,null,"",0,null,""]
[224,null,null,null,null,null,1,{"$f":"IF(Etusivu!$C$20=\"kyllä\",24%,0%)","v":0.24},0,0,0,0,0,0,null,"",0,null,"",0,null,""]
[225,null,null,null,null,null,1,{"$f":"IF(Etusivu!$C$20=\"kyllä\",24%,0%)","v":0.24},0,0,0,0,0,0,null,"",0,null,"",0,null,""]
[226,null,null,null,null,null,1,{"$f":"IF(Etusivu!$C$20=\"kyllä\",24%,0%)","v":0.24},0,0,0,0,0,0,null,"",0,null,"",0,null,""]
[227,null,null,null,null,null,1,{"$f":"IF(Etusivu!$C$20=\"kyllä\",24%,0%)","v":0.24},0,0,0,0,0,0,null,"",0,null,"",0,null,""]
[228,null,null,null,null,null,1,{"$f":"IF(Etusivu!$C$20=\"kyllä\",24%,0%)","v":0.24},0,0,0,0,0,0,null,"",0,null,"",0,null,""]
[229,null,null,null,null,null,1,{"$f":"IF(Etusivu!$C$20=\"kyllä\",24%,0%)","v":0.24},0,0,0,0,0,0,null,"",0,null,"",0,null,""]
[230,null,null,null,null,null,1,{"$f":"IF(Etusivu!$C$20=\"kyllä\",24%,0%)","v":0.24},0,0,0,0,0,0,null,"",0,null,"",0,null,""]
[231,null,null,null,null,null,1,{"$f":"IF(Etusivu!$C$20=\"kyllä\",24%,0%)","v":0.24},0,0,0,0,0,0,null,"",0,null,"",0,null,""]
[232,null,null,null,null,null,1,{"$f":"IF(Etusivu!$C$20=\"kyllä\",24%,0%)","v":0.24},0,0,0,0,0,0,null,"",0,null,"",0,null,""]
[233,null,null,null,null,null,1,{"$f":"IF(Etusivu!$C$20=\"kyllä\",24%,0%)","v":0.24},0,0,0,0,0,0,null,"",0,null,"",0,null,""]
[234,null,null,null,null,null,1,{"$f":"IF(Etusivu!$C$20=\"kyllä\",24%,0%)","v":0.24},0,0,0,0,0,0,null,"",0,null,"",0,null,""]
[235,null,null,null,null,null,1,{"$f":"IF(Etusivu!$C$20=\"kyllä\",24%,0%)","v":0.24},0,0,0,0,0,0,null,"",0,null,"",0,null,""]
[236,null,null,null,null,null,1,{"$f":"IF(Etusivu!$C$20=\"kyllä\",24%,0%)","v":0.24},0,0,0,0,0,0,null,"",0,null,"",0,null,""]
[237,null,null,null,null,null,1,{"$f":"IF(Etusivu!$C$20=\"kyllä\",24%,0%)","v":0.24},0,0,0,0,0,0,null,"",0,null,"",0,null,""]
[238,null,null,null,null,null,1,{"$f":"IF(Etusivu!$C$20=\"kyllä\",24%,0%)","v":0.24},0,0,0,0,0,0,null,"",0,null,"",0,null,""]
[239,null,null,null,null,null,1,{"$f":"IF(Etusivu!$C$20=\"kyllä\",24%,0%)","v":0.24},0,0,0,0,0,0,null,"",0,null,"",0,null,""]
[240,null,null,null,null,null,1,{"$f":"IF(Etusivu!$C$20=\"kyllä\",24%,0%)","v":0.24},0,0,0,0,0,0,null,"",0,null,"",0,null,""]
[241,null,null,null,null,null,1,{"$f":"IF(Etusivu!$C$20=\"kyllä\",24%,0%)","v":0.24},0,0,0,0,0,0,null,"",0,null,"",0,null,""]
[242,null,null,null,null,null,1,{"$f":"IF(Etusivu!$C$20=\"kyllä\",24%,0%)","v":0.24},0,0,0,0,0,0,null,"",0,null,"",0,null,""]
[243,null,null,null,null,null,1,{"$f":"IF(Etusivu!$C$20=\"kyllä\",24%,0%)","v":0.24},0,0,0,0,0,0,null,"",0,null,"",0,null,""]
[244,null,null,null,null,null,1,{"$f":"IF(Etusivu!$C$20=\"kyllä\",24%,0%)","v":0.24},0,0,0,0,0,0,null,"",0,null,"",0,null,""]
[245,null,null,null,null,null,1,{"$f":"IF(Etusivu!$C$20=\"kyllä\",24%,0%)","v":0.24},0,0,0,0,0,0,null,"",0,null,"",0,null,""]
[246,null,null,null,null,null,1,{"$f":"IF(Etusivu!$C$20=\"kyllä\",24%,0%)","v":0.24},0,0,0,0,0,0,null,"",0,null,"",0,null,""]
[247,null,null,null,null,null,1,{"$f":"IF(Etusivu!$C$20=\"kyllä\",24%,0%)","v":0.24},0,0,0,0,0,0,null,"",0,null,"",0,null,""]
[248,null,null,null,null,null,1,{"$f":"IF(Etusivu!$C$20=\"kyllä\",24%,0%)","v":0.24},0,0,0,0,0,0,null,"",0,null,"",0,null,""]
[249,null,null,null,null,null,1,{"$f":"IF(Etusivu!$C$20=\"kyllä\",24%,0%)","v":0.24},0,0,0,0,0,0,null,"",0,null,"",0,null,""]
[250,null,null,null,null,null,1,{"$f":"IF(Etusivu!$C$20=\"kyllä\",24%,0%)","v":0.24},0,0,0,0,0,0,null,"",0,null,"",0,null,""]
[251,null,null,null,null,null,1,{"$f":"IF(Etusivu!$C$20=\"kyllä\",24%,0%)","v":0.24},0,0,0,0,0,0,null,"",0,null,"",0,null,""]
[252,null,null,null,null,null,1,{"$f":"IF(Etusivu!$C$20=\"kyllä\",24%,0%)","v":0.24},0,0,0,0,0,0,null,"",0,null,"",0,null,""]
[253,null,null,null,null,null,1,{"$f":"IF(Etusivu!$C$20=\"kyllä\",24%,0%)","v":0.24},0,0,0,0,0,0,null,"",0,null,"",0,null,""]
[254,null,null,null,null,null,1,{"$f":"IF(Etusivu!$C$20=\"kyllä\",24%,0%)","v":0.24},0,0,0,0,0,0,null,"",0,null,"",0,null,""]
[255,null,null,null,null,null,1,{"$f":"IF(Etusivu!$C$20=\"kyllä\",24%,0%)","v":0.24},0,0,0,0,0,0,null,"",0,null,"",0,null,""]
[256,null,null,null,null,null,1,{"$f":"IF(Etusivu!$C$20=\"kyllä\",24%,0%)","v":0.24},0,0,0,0,0,0,null,"",0,null,"",0,null,""]
[257,null,null,null,null,null,1,{"$f":"IF(Etusivu!$C$20=\"kyllä\",24%,0%)","v":0.24},0,0,0,0,0,0,null,"",0,null,"",0,null,""]
[258,null,null,null,null,null,1,{"$f":"IF(Etusivu!$C$20=\"kyllä\",24%,0%)","v":0.24},0,0,0,0,0,0,null,"",0,null,"",0,null,""]
[259,null,null,null,null,null,1,{"$f":"IF(Etusivu!$C$20=\"kyllä\",24%,0%)","v":0.24},0,0,0,0,0,0,null,"",0,null,"",0,null,""]
[260,null,null,null,null,null,1,{"$f":"IF(Etusivu!$C$20=\"kyllä\",24%,0%)","v":0.24},0,0,0,0,0,0,null,"",0,null,"",0,null,""]
[261,null,null,null,null,null,1,{"$f":"IF(Etusivu!$C$20=\"kyllä\",24%,0%)","v":0.24},0,0,0,0,0,0,null,"",0,null,"",0,null,""]
[262,null,null,null,null,null,1,{"$f":"IF(Etusivu!$C$20=\"kyllä\",24%,0%)","v":0.24},0,0,0,0,0,0,null,"",0,null,"",0,null,""]
[263,null,null,null,null,null,1,{"$f":"IF(Etusivu!$C$20=\"kyllä\",24%,0%)","v":0.24},0,0,0,0,0,0,null,"",0,null,"",0,null,""]
[264,null,null,null,null,null,1,{"$f":"IF(Etusivu!$C$20=\"kyllä\",24%,0%)","v":0.24},0,0,{"$f":"IF($E76=K$11,$J76,0)-IF(E76=K$11,SUM(X76:Z76),0)","v":0},{"$f":"IF($E76=L$11,$J76,0)-IF(E76=L$11,SUM(X76:Z76),0)","v":0},{"$f":"IF($E76=M$11,$J76,0)-IF(E76=M$11,SUM(X76:Z76),0)","v":0},{"$f":"IF($E76=N$11,$J76,0)-IF(E76=N$11,SUM(X76:Z76),0)","v":0},null,"",{"$f":"IF($E76=Q$11,$J76,0)-IF(E76=Q$11,SUM(X76:Z76),0)","v":0},null,"",{"$f":"IF($E76=T$11,$J76,0)-IF(E76=T$11,SUM(X76:Z76),0)","v":0},null,""]
[265,null,null,null,null,null,1,{"$f":"IF(Etusivu!$C$20=\"kyllä\",24%,0%)","v":0.24},0,0,0,0,0,0,null,"",0,null,"",0,null,""]
[266,null,null,null,null,null,1,{"$f":"IF(Etusivu!$C$20=\"kyllä\",24%,0%)","v":0.24},{"$f":"G78*((F78-(X78+Y78+Z78)*(1+H78))-((F78-(X78+Y78+Z78)*(1+H78))/(1+H78)))","v":0},{"$f":"G78*(F78/(1+H78))","v":0},0,0,0,0,null,{"$f":"IF(N78>0,IF(O78<1,\" !\",\"\"),\"\")","v":""},0,null,{"$f":"IF(Q78>0,IF(R78<1,\" !\",\"\"),\"\")","v":""},0,null,{"$f":"IF(T78>0,IF(U78<1,\" !\",\"\"),\"\")","v":""}]
[267,null,null,null,null,null,1,{"$f":"IF(Etusivu!$C$20=\"kyllä\",24%,0%)","v":0.24},0,0,0,0,0,0,null,"",0,null,"",0,null,""]
[268,null,null,null,null,null,1,{"$f":"IF(Etusivu!$C$20=\"kyllä\",24%,0%)","v":0.24},0,0,0,0,0,0,null,"",0,null,"",0,null,""]
[269,null,null,null,null,null,1,{"$f":"IF(Etusivu!$C$20=\"kyllä\",24%,0%)","v":0.24},0,0,0,0,0,0,null,"",0,null,"",0,null,""]
[270,null,null,null,null,null,1,{"$f":"IF(Etusivu!$C$20=\"kyllä\",24%,0%)","v":0.24},0,0,0,0,0,0,null,"",0,null,"",0,null,""]
[271,null,null,null,null,null,1,{"$f":"IF(Etusivu!$C$20=\"kyllä\",24%,0%)","v":0.24},0,0,0,0,0,0,null,"",0,null,"",0,null,""]
[272,null,null,null,null,null,1,{"$f":"IF(Etusivu!$C$20=\"kyllä\",24%,0%)","v":0.24},0,0,0,0,0,0,null,"",0,null,"",0,null,""]
[273,null,null,null,null,null,1,{"$f":"IF(Etusivu!$C$20=\"kyllä\",24%,0%)","v":0.24},0,0,0,0,0,0,null,"",0,null,"",0,null,""]
[274,null,null,null,null,null,1,{"$f":"IF(Etusivu!$C$20=\"kyllä\",24%,0%)","v":0.24},0,0,0,0,0,0,null,"",0,null,"",0,null,""]
[275,null,null,null,null,null,1,{"$f":"IF(Etusivu!$C$20=\"kyllä\",24%,0%)","v":0.24},0,0,0,0,0,0,null,"",0,null,"",0,null,""]
[276,null,null,null,null,null,1,{"$f":"IF(Etusivu!$C$20=\"kyllä\",24%,0%)","v":0.24},0,0,0,0,0,0,null,"",0,null,"",0,null,""]
[277,null,null,null,null,null,1,{"$f":"IF(Etusivu!$C$20=\"kyllä\",24%,0%)","v":0.24},0,0,0,0,0,0,null,"",0,null,"",0,null,""]
[278,null,null,null,null,null,1,{"$f":"IF(Etusivu!$C$20=\"kyllä\",24%,0%)","v":0.24},0,0,0,0,0,0,null,"",0,null,"",0,null,""]
[279,null,null,null,null,null,1,{"$f":"IF(Etusivu!$C$20=\"kyllä\",24%,0%)","v":0.24},0,0,0,0,0,0,null,"",0,null,"",0,null,""]
[280,null,null,null,null,null,1,{"$f":"IF(Etusivu!$C$20=\"kyllä\",24%,0%)","v":0.24},0,0,0,0,0,0,null,"",0,null,"",0,null,""]
[281,null,null,null,null,null,1,{"$f":"IF(Etusivu!$C$20=\"kyllä\",24%,0%)","v":0.24},0,0,0,0,0,0,null,"",0,null,"",0,null,""]
[282,null,null,null,null,null,1,{"$f":"IF(Etusivu!$C$20=\"kyllä\",24%,0%)","v":0.24},0,0,0,0,0,0,null,"",0,null,"",0,null,""]
[283,null,null,null,null,null,1,{"$f":"IF(Etusivu!$C$20=\"kyllä\",24%,0%)","v":0.24},0,0,0,0,0,0,null,"",0,null,"",0,null,""]
[284,null,null,null,null,null,1,{"$f":"IF(Etusivu!$C$20=\"kyllä\",24%,0%)","v":0.24},0,0,0,0,0,0,null,"",0,null,"",0,null,""]
[285,null,null,null,null,null,1,{"$f":"IF(Etusivu!$C$20=\"kyllä\",24%,0%)","v":0.24},0,0,0,0,0,0,null,"",0,null,"",0,null,""]
[286,null,null,null,null,null,1,{"$f":"IF(Etusivu!$C$20=\"kyllä\",24%,0%)","v":0.24},0,0,0,0,0,0,null,"",0,null,"",0,null,""]
[287,null,null,null,null,null,1,{"$f":"IF(Etusivu!$C$20=\"kyllä\",24%,0%)","v":0.24},0,0,0,0,0,0,null,"",0,null,"",0,null,""]
[288,null,null,null,null,null,1,{"$f":"IF(Etusivu!$C$20=\"kyllä\",24%,0%)","v":0.24},0,0,0,0,0,0,null,"",0,null,"",0,null,""]
[289,null,null,null,null,null,1,{"$f":"IF(Etusivu!$C$20=\"kyllä\",24%,0%)","v":0.24},0,0,0,0,0,0,null,"",0,null,"",0,null,""]
[290,null,null,null,null,null,1,{"$f":"IF(Etusivu!$C$20=\"kyllä\",24%,0%)","v":0.24},0,0,0,0,0,0,null,"",0,null,"",0,null,""]
[291,null,null,null,null,null,1,{"$f":"IF(Etusivu!$C$20=\"kyllä\",24%,0%)","v":0.24},0,0,0,0,0,0,null,"",0,null,"",0,null,""]
[292,null,null,null,null,null,1,{"$f":"IF(Etusivu!$C$20=\"kyllä\",24%,0%)","v":0.24},0,0,0,0,0,0,null,"",0,null,"",0,null,""]
[293,null,null,null,null,null,1,{"$f":"IF(Etusivu!$C$20=\"kyllä\",24%,0%)","v":0.24},0,0,0,0,0,0,null,"",0,null,"",0,null,""]
[294,null,null,null,null,null,1,{"$f":"IF(Etusivu!$C$20=\"kyllä\",24%,0%)","v":0.24},0,0,0,0,0,0,null,"",0,null,"",0,null,""]
[295,null,null,null,null,null,1,{"$f":"IF(Etusivu!$C$20=\"kyllä\",24%,0%)","v":0.24},0,0,0,0,0,0,null,"",0,null,"",0,null,""]
[296,null,null,null,null,null,1,{"$f":"IF(Etusivu!$C$20=\"kyllä\",24%,0%)","v":0.24},0,0,0,0,0,0,null,"",0,null,"",0,null,""]
[297,null,null,null,null,null,1,{"$f":"IF(Etusivu!$C$20=\"kyllä\",24%,0%)","v":0.24},0,0,0,0,0,0,null,"",0,null,"",0,null,""]
[298,null,null,null,null,null,1,{"$f":"IF(Etusivu!$C$20=\"kyllä\",24%,0%)","v":0.24},0,0,0,0,0,0,null,"",0,null,"",0,null,""]
[299,null,null,null,null,null,1,{"$f":"IF(Etusivu!$C$20=\"kyllä\",24%,0%)","v":0.24},0,0,0,0,0,0,null,"",0,null,"",0,null,""]
[300,null,null,null,null,null,1,{"$f":"IF(Etusivu!$C$20=\"kyllä\",24%,0%)","v":0.24},0,0,0,0,0,0,null,"",0,null,"",0,null,""]
[301,null,null,null,null,null,1,{"$f":"IF(Etusivu!$C$20=\"kyllä\",24%,0%)","v":0.24},0,0,0,0,0,0,null,"",0,null,"",0,null,""]
[302,null,null,null,null,null,1,{"$f":"IF(Etusivu!$C$20=\"kyllä\",24%,0%)","v":0.24},0,0,0,0,0,0,null,"",0,null,"",0,null,""]
[303,null,null,null,null,null,1,{"$f":"IF(Etusivu!$C$20=\"kyllä\",24%,0%)","v":0.24},0,0,0,0,0,0,null,"",0,null,"",0,null,""]
[304,null,null,null,null,null,1,{"$f":"IF(Etusivu!$C$20=\"kyllä\",24%,0%)","v":0.24},0,0,0,0,0,0,null,"",0,null,"",0,null,""]
[305,null,null,null,null,null,1,{"$f":"IF(Etusivu!$C$20=\"kyllä\",24%,0%)","v":0.24},0,0,0,0,0,0,null,"",0,null,"",0,null,""]
[306,null,null,null,null,null,1,{"$f":"IF(Etusivu!$C$20=\"kyllä\",24%,0%)","v":0.24},0,0,0,0,0,0,null,"",0,null,"",0,null,""]
[307,null,null,null,null,null,1,{"$f":"IF(Etusivu!$C$20=\"kyllä\",24%,0%)","v":0.24},0,0,0,0,0,0,null,"",0,null,"",0,null,""]
[308,null,null,null,null,null,1,{"$f":"IF(Etusivu!$C$20=\"kyllä\",24%,0%)","v":0.24},0,0,0,0,0,0,null,"",0,null,"",0,null,""]
[309,null,null,null,null,null,1,{"$f":"IF(Etusivu!$C$20=\"kyllä\",24%,0%)","v":0.24},0,0,0,0,0,0,null,"",0,null,"",0,null,""]
[310,null,null,null,null,null,1,{"$f":"IF(Etusivu!$C$20=\"kyllä\",24%,0%)","v":0.24},0,0,0,0,0,0,null,"",0,null,"",0,null,""]
[311,null,null,null,null,null,1,{"$f":"IF(Etusivu!$C$20=\"kyllä\",24%,0%)","v":0.24},0,0,0,0,0,0,null,"",0,null,"",0,null,""]
[312,null,null,null,null,null,1,{"$f":"IF(Etusivu!$C$20=\"kyllä\",24%,0%)","v":0.24},0,0,0,0,0,0,null,"",0,null,"",0,null,""]
[313,null,null,null,null,null,1,{"$f":"IF(Etusivu!$C$20=\"kyllä\",24%,0%)","v":0.24},0,0,0,0,0,0,null,"",0,null,"",0,null,""]
[314,null,null,null,null,null,1,{"$f":"IF(Etusivu!$C$20=\"kyllä\",24%,0%)","v":0.24},0,0,0,0,0,0,null,"",0,null,"",0,null,""]
[315,null,null,null,null,null,1,{"$f":"IF(Etusivu!$C$20=\"kyllä\",24%,0%)","v":0.24},0,0,0,0,0,0,null,"",0,null,"",0,null,""]
[316,null,null,null,null,null,1,{"$f":"IF(Etusivu!$C$20=\"kyllä\",24%,0%)","v":0.24},0,0,0,0,0,0,null,"",0,null,"",0,null,""]
[317,null,null,null,null,null,1,{"$f":"IF(Etusivu!$C$20=\"kyllä\",24%,0%)","v":0.24},0,0,0,0,0,0,null,"",0,null,"",0,null,""]
[318,null,null,null,null,null,1,{"$f":"IF(Etusivu!$C$20=\"kyllä\",24%,0%)","v":0.24},0,0,0,0,0,0,null,"",0,null,"",0,null,""]
[319,null,null,null,null,null,1,{"$f":"IF(Etusivu!$C$20=\"kyllä\",24%,0%)","v":0.24},0,0,0,0,0,0,null,"",0,null,"",0,null,""]
[320,null,null,null,null,null,1,{"$f":"IF(Etusivu!$C$20=\"kyllä\",24%,0%)","v":0.24},0,0,0,0,0,0,null,"",0,null,"",0,null,""]
[321,null,null,null,null,null,1,{"$f":"IF(Etusivu!$C$20=\"kyllä\",24%,0%)","v":0.24},0,0,0,0,0,0,null,"",0,null,"",0,null,""]
[322,null,null,null,null,null,1,{"$f":"IF(Etusivu!$C$20=\"kyllä\",24%,0%)","v":0.24},0,0,0,0,0,0,null,"",0,null,"",0,null,""]
[323,null,null,null,null,null,1,{"$f":"IF(Etusivu!$C$20=\"kyllä\",24%,0%)","v":0.24},0,0,0,0,0,0,null,"",0,null,"",0,null,""]
[324,null,null,null,null,null,1,{"$f":"IF(Etusivu!$C$20=\"kyllä\",24%,0%)","v":0.24},0,0,0,0,0,0,null,"",0,null,"",0,null,""]
[325,null,null,null,null,null,1,{"$f":"IF(Etusivu!$C$20=\"kyllä\",24%,0%)","v":0.24},0,0,0,0,0,0,null,"",0,null,"",0,null,""]
[326,null,null,null,null,null,1,{"$f":"IF(Etusivu!$C$20=\"kyllä\",24%,0%)","v":0.24},0,0,0,0,0,0,null,"",0,null,"",0,null,""]
[327,null,null,null,null,null,1,{"$f":"IF(Etusivu!$C$20=\"kyllä\",24%,0%)","v":0.24},0,0,0,0,0,0,null,"",0,null,"",0,null,""]
[328,null,null,null,null,null,1,{"$f":"IF(Etusivu!$C$20=\"kyllä\",24%,0%)","v":0.24},0,0,{"$f":"IF($E140=K$11,$J140,0)-IF(E140=K$11,SUM(X140:Z140),0)","v":0},{"$f":"IF($E140=L$11,$J140,0)-IF(E140=L$11,SUM(X140:Z140),0)","v":0},{"$f":"IF($E140=M$11,$J140,0)-IF(E140=M$11,SUM(X140:Z140),0)","v":0},{"$f":"IF($E140=N$11,$J140,0)-IF(E140=N$11,SUM(X140:Z140),0)","v":0},null,"",{"$f":"IF($E140=Q$11,$J140,0)-IF(E140=Q$11,SUM(X140:Z140),0)","v":0},null,"",{"$f":"IF($E140=T$11,$J140,0)-IF(E140=T$11,SUM(X140:Z140),0)","v":0},null,""]
[329,null,null,null,null,null,1,{"$f":"IF(Etusivu!$C$20=\"kyllä\",24%,0%)","v":0.24},0,0,0,0,0,0,null,"",0,null,"",0,null,""]
[330,null,null,null,null,null,1,{"$f":"IF(Etusivu!$C$20=\"kyllä\",24%,0%)","v":0.24},{"$f":"G142*((F142-(X142+Y142+Z142)*(1+H142))-((F142-(X142+Y142+Z142)*(1+H142))/(1+H142)))","v":0},{"$f":"G142*(F142/(1+H142))","v":0},0,0,0,0,null,{"$f":"IF(N142>0,IF(O142<1,\" !\",\"\"),\"\")","v":""},0,null,{"$f":"IF(Q142>0,IF(R142<1,\" !\",\"\"),\"\")","v":""},0,null,{"$f":"IF(T142>0,IF(U142<1,\" !\",\"\"),\"\")","v":""}]
[331,null,null,null,null,null,1,{"$f":"IF(Etusivu!$C$20=\"kyllä\",24%,0%)","v":0.24},0,0,0,0,0,0,null,"",0,null,"",0,null,""]
[332,null,null,null,null,null,1,{"$f":"IF(Etusivu!$C$20=\"kyllä\",24%,0%)","v":0.24},0,0,0,0,0,0,null,"",0,null,"",0,null,""]
[333,null,null,null,null,null,1,{"$f":"IF(Etusivu!$C$20=\"kyllä\",24%,0%)","v":0.24},0,0,0,0,0,0,null,"",0,null,"",0,null,""]
[334,null,null,null,null,null,1,{"$f":"IF(Etusivu!$C$20=\"kyllä\",24%,0%)","v":0.24},0,0,0,0,0,0,null,"",0,null,"",0,null,""]
[335,null,null,null,null,null,1,{"$f":"IF(Etusivu!$C$20=\"kyllä\",24%,0%)","v":0.24},0,0,0,0,0,0,null,"",0,null,"",0,null,""]
[336,null,null,null,null,null,1,{"$f":"IF(Etusivu!$C$20=\"kyllä\",24%,0%)","v":0.24},0,0,0,0,0,0,null,"",0,null,"",0,null,""]
[337,null,null,null,null,null,1,{"$f":"IF(Etusivu!$C$20=\"kyllä\",24%,0%)","v":0.24},0,0,0,0,0,0,null,"",0,null,"",0,null,""]
[338,null,null,null,null,null,1,{"$f":"IF(Etusivu!$C$20=\"kyllä\",24%,0%)","v":0.24},0,0,0,0,0,0,null,"",0,null,"",0,null,""]
[339,null,null,null,null,null,1,{"$f":"IF(Etusivu!$C$20=\"kyllä\",24%,0%)","v":0.24},0,0,0,0,0,0,null,"",0,null,"",0,null,""]
[340,null,null,null,null,null,1,{"$f":"IF(Etusivu!$C$20=\"kyllä\",24%,0%)","v":0.24},0,0,0,0,0,0,null,"",0,null,"",0,null,""]
[341,null,null,null,null,null,1,{"$f":"IF(Etusivu!$C$20=\"kyllä\",24%,0%)","v":0.24},0,0,0,0,0,0,null,"",0,null,"",0,null,""]
[342,null,null,null,null,null,1,{"$f":"IF(Etusivu!$C$20=\"kyllä\",24%,0%)","v":0.24},0,0,0,0,0,0,null,"",0,null,"",0,null,""]
[343,null,null,null,null,null,1,{"$f":"IF(Etusivu!$C$20=\"kyllä\",24%,0%)","v":0.24},0,0,0,0,0,0,null,"",0,null,"",0,null,""]
[344,null,null,null,null,null,1,{"$f":"IF(Etusivu!$C$20=\"kyllä\",24%,0%)","v":0.24},0,0,0,0,0,0,null,"",0,null,"",0,null,""]
[345,null,null,null,null,null,1,{"$f":"IF(Etusivu!$C$20=\"kyllä\",24%,0%)","v":0.24},0,0,0,0,0,0,null,"",0,null,"",0,null,""]
[346,null,null,null,null,null,1,{"$f":"IF(Etusivu!$C$20=\"kyllä\",24%,0%)","v":0.24},0,0,0,0,0,0,null,"",0,null,"",0,null,""]
[347,null,null,null,null,null,1,{"$f":"IF(Etusivu!$C$20=\"kyllä\",24%,0%)","v":0.24},0,0,0,0,0,0,null,"",0,null,"",0,null,""]
[348,null,null,null,null,null,1,{"$f":"IF(Etusivu!$C$20=\"kyllä\",24%,0%)","v":0.24},0,0,0,0,0,0,null,"",0,null,"",0,null,""]
[349,null,null,null,null,null,1,{"$f":"IF(Etusivu!$C$20=\"kyllä\",24%,0%)","v":0.24},0,0,0,0,0,0,null,"",0,null,"",0,null,""]
[350,null,null,null,null,null,1,{"$f":"IF(Etusivu!$C$20=\"kyllä\",24%,0%)","v":0.24},0,0,0,0,0,0,null,"",0,null,"",0,null,""]
[351,null,null,null,null,null,1,{"$f":"IF(Etusivu!$C$20=\"kyllä\",24%,0%)","v":0.24},0,0,0,0,0,0,null,"",0,null,"",0,null,""]
[352,null,null,null,null,null,1,{"$f":"IF(Etusivu!$C$20=\"kyllä\",24%,0%)","v":0.24},0,0,0,0,0,0,null,"",0,null,"",0,null,""]
[353,null,null,null,null,null,1,{"$f":"IF(Etusivu!$C$20=\"kyllä\",24%,0%)","v":0.24},0,0,0,0,0,0,null,"",0,null,"",0,null,""]
[354,null,null,null,null,null,1,{"$f":"IF(Etusivu!$C$20=\"kyllä\",24%,0%)","v":0.24},0,0,0,0,0,0,null,"",0,null,"",0,null,""]
[355,null,null,null,null,null,1,{"$f":"IF(Etusivu!$C$20=\"kyllä\",24%,0%)","v":0.24},0,0,0,0,0,0,null,"",0,null,"",0,null,""]
[356,null,null,null,null,null,1,{"$f":"IF(Etusivu!$C$20=\"kyllä\",24%,0%)","v":0.24},0,0,0,0,0,0,null,"",0,null,"",0,null,""]
[357,null,null,null,null,null,1,{"$f":"IF(Etusivu!$C$20=\"kyllä\",24%,0%)","v":0.24},0,0,0,0,0,0,null,"",0,null,"",0,null,""]
[358,null,null,null,null,null,1,{"$f":"IF(Etusivu!$C$20=\"kyllä\",24%,0%)","v":0.24},0,0,0,0,0,0,null,"",0,null,"",0,null,""]
[359,null,null,null,null,null,1,{"$f":"IF(Etusivu!$C$20=\"kyllä\",24%,0%)","v":0.24},0,0,0,0,0,0,null,"",0,null,"",0,null,""]
[360,null,null,null,null,null,1,{"$f":"IF(Etusivu!$C$20=\"kyllä\",24%,0%)","v":0.24},0,0,0,0,0,0,null,"",0,null,"",0,null,""]
[361,null,null,null,null,null,1,{"$f":"IF(Etusivu!$C$20=\"kyllä\",24%,0%)","v":0.24},0,0,0,0,0,0,null,"",0,null,"",0,null,""]
[362,null,null,null,null,null,1,{"$f":"IF(Etusivu!$C$20=\"kyllä\",24%,0%)","v":0.24},0,0,0,0,0,0,null,"",0,null,"",0,null,""]
[363,null,null,null,null,null,1,{"$f":"IF(Etusivu!$C$20=\"kyllä\",24%,0%)","v":0.24},0,0,0,0,0,0,null,"",0,null,"",0,null,""]
[364,null,null,null,null,null,1,{"$f":"IF(Etusivu!$C$20=\"kyllä\",24%,0%)","v":0.24},0,0,0,0,0,0,null,"",0,null,"",0,null,""]
[365,null,null,null,null,null,1,{"$f":"IF(Etusivu!$C$20=\"kyllä\",24%,0%)","v":0.24},0,0,0,0,0,0,null,"",0,null,"",0,null,""]
[366,null,null,null,null,null,1,{"$f":"IF(Etusivu!$C$20=\"kyllä\",24%,0%)","v":0.24},0,0,0,0,0,0,null,"",0,null,"",0,null,""]
[367,null,null,null,null,null,1,{"$f":"IF(Etusivu!$C$20=\"kyllä\",24%,0%)","v":0.24},0,0,0,0,0,0,null,"",0,null,"",0,null,""]
[368,null,null,null,null,null,1,{"$f":"IF(Etusivu!$C$20=\"kyllä\",24%,0%)","v":0.24},0,0,0,0,0,0,null,"",0,null,"",0,null,""]
[369,null,null,null,null,null,1,{"$f":"IF(Etusivu!$C$20=\"kyllä\",24%,0%)","v":0.24},0,0,0,0,0,0,null,"",0,null,"",0,null,""]
[370,null,null,null,null,null,1,{"$f":"IF(Etusivu!$C$20=\"kyllä\",24%,0%)","v":0.24},0,0,0,0,0,0,null,"",0,null,"",0,null,""]
[371,null,null,null,null,null,1,{"$f":"IF(Etusivu!$C$20=\"kyllä\",24%,0%)","v":0.24},0,0,0,0,0,0,null,"",0,null,"",0,null,""]
[372,null,null,null,null,null,1,{"$f":"IF(Etusivu!$C$20=\"kyllä\",24%,0%)","v":0.24},0,0,0,0,0,0,null,"",0,null,"",0,null,""]
[373,null,null,null,null,null,1,{"$f":"IF(Etusivu!$C$20=\"kyllä\",24%,0%)","v":0.24},0,0,0,0,0,0,null,"",0,null,"",0,null,""]
[374,null,null,null,null,null,1,{"$f":"IF(Etusivu!$C$20=\"kyllä\",24%,0%)","v":0.24},0,0,0,0,0,0,null,"",0,null,"",0,null,""]
[375,null,null,null,null,null,1,{"$f":"IF(Etusivu!$C$20=\"kyllä\",24%,0%)","v":0.24},0,0,0,0,0,0,null,"",0,null,"",0,null,""]
[376,null,null,null,null,null,1,{"$f":"IF(Etusivu!$C$20=\"kyllä\",24%,0%)","v":0.24},0,0,0,0,0,0,null,"",0,null,"",0,null,""]
[377,null,null,null,null,null,1,{"$f":"IF(Etusivu!$C$20=\"kyllä\",24%,0%)","v":0.24},0,0,0,0,0,0,null,"",0,null,"",0,null,""]
[378,null,null,null,null,null,1,{"$f":"IF(Etusivu!$C$20=\"kyllä\",24%,0%)","v":0.24},0,0,0,0,0,0,null,"",0,null,"",0,null,""]
[379,null,null,null,null,null,1,{"$f":"IF(Etusivu!$C$20=\"kyllä\",24%,0%)","v":0.24},0,0,0,0,0,0,null,"",0,null,"",0,null,""]
[380,null,null,null,null,null,1,{"$f":"IF(Etusivu!$C$20=\"kyllä\",24%,0%)","v":0.24},0,0,0,0,0,0,null,"",0,null,"",0,null,""]
[381,null,null,null,null,null,1,{"$f":"IF(Etusivu!$C$20=\"kyllä\",24%,0%)","v":0.24},0,0,0,0,0,0,null,"",0,null,"",0,null,""]
[382,null,null,null,null,null,1,{"$f":"IF(Etusivu!$C$20=\"kyllä\",24%,0%)","v":0.24},0,0,0,0,0,0,null,"",0,null,"",0,null,""]
[383,null,null,null,null,null,1,{"$f":"IF(Etusivu!$C$20=\"kyllä\",24%,0%)","v":0.24},0,0,0,0,0,0,null,"",0,null,"",0,null,""]
[384,null,null,null,null,null,1,{"$f":"IF(Etusivu!$C$20=\"kyllä\",24%,0%)","v":0.24},0,0,0,0,0,0,null,"",0,null,"",0,null,""]
[385,null,null,null,null,null,1,{"$f":"IF(Etusivu!$C$20=\"kyllä\",24%,0%)","v":0.24},0,0,0,0,0,0,null,"",0,null,"",0,null,""]
[386,null,null,null,null,null,1,{"$f":"IF(Etusivu!$C$20=\"kyllä\",24%,0%)","v":0.24},0,0,0,0,0,0,null,"",0,null,"",0,null,""]
[387,null,null,null,null,null,1,{"$f":"IF(Etusivu!$C$20=\"kyllä\",24%,0%)","v":0.24},0,0,0,0,0,0,null,"",0,null,"",0,null,""]
[388,null,null,null,null,null,1,{"$f":"IF(Etusivu!$C$20=\"kyllä\",24%,0%)","v":0.24},0,0,0,0,0,0,null,"",0,null,"",0,null,""]
[389,null,null,null,null,null,1,{"$f":"IF(Etusivu!$C$20=\"kyllä\",24%,0%)","v":0.24},0,0,0,0,0,0,null,"",0,null,"",0,null,""]
[390,null,null,null,null,null,1,{"$f":"IF(Etusivu!$C$20=\"kyllä\",24%,0%)","v":0.24},0,0,0,0,0,0,null,"",0,null,"",0,null,""]
[391,null,null,null,null,null,1,{"$f":"IF(Etusivu!$C$20=\"kyllä\",24%,0%)","v":0.24},0,0,0,0,0,0,null,"",0,null,"",0,null,""]
[392,null,null,null,null,null,1,{"$f":"IF(Etusivu!$C$20=\"kyllä\",24%,0%)","v":0.24},0,0,{"$f":"IF($E204=K$11,$J204,0)-IF(E204=K$11,SUM(X204:Z204),0)","v":0},{"$f":"IF($E204=L$11,$J204,0)-IF(E204=L$11,SUM(X204:Z204),0)","v":0},{"$f":"IF($E204=M$11,$J204,0)-IF(E204=M$11,SUM(X204:Z204),0)","v":0},{"$f":"IF($E204=N$11,$J204,0)-IF(E204=N$11,SUM(X204:Z204),0)","v":0},null,"",{"$f":"IF($E204=Q$11,$J204,0)-IF(E204=Q$11,SUM(X204:Z204),0)","v":0},null,"",{"$f":"IF($E204=T$11,$J204,0)-IF(E204=T$11,SUM(X204:Z204),0)","v":0},null,""]
[393,null,null,null,null,null,1,{"$f":"IF(Etusivu!$C$20=\"kyllä\",24%,0%)","v":0.24},0,0,0,0,0,0,null,"",0,null,"",0,null,""]
[394,null,null,null,null,null,1,{"$f":"IF(Etusivu!$C$20=\"kyllä\",24%,0%)","v":0.24},{"$f":"G206*((F206-(X206+Y206+Z206)*(1+H206))-((F206-(X206+Y206+Z206)*(1+H206))/(1+H206)))","v":0},{"$f":"G206*(F206/(1+H206))","v":0},0,0,0,0,null,{"$f":"IF(N206>0,IF(O206<1,\" !\",\"\"),\"\")","v":""},0,null,{"$f":"IF(Q206>0,IF(R206<1,\" !\",\"\"),\"\")","v":""},0,null,{"$f":"IF(T206>0,IF(U206<1,\" !\",\"\"),\"\")","v":""}]
[395,null,null,null,null,null,1,{"$f":"IF(Etusivu!$C$20=\"kyllä\",24%,0%)","v":0.24},0,0,0,0,0,0,null,"",0,null,"",0,null,""]
[396,null,null,null,null,null,1,{"$f":"IF(Etusivu!$C$20=\"kyllä\",24%,0%)","v":0.24},0,0,0,0,0,0,null,"",0,null,"",0,null,""]
[397,null,null,null,null,null,1,{"$f":"IF(Etusivu!$C$20=\"kyllä\",24%,0%)","v":0.24},0,0,0,0,0,0,null,"",0,null,"",0,null,""]
[398,null,null,null,null,null,1,{"$f":"IF(Etusivu!$C$20=\"kyllä\",24%,0%)","v":0.24},0,0,0,0,0,0,null,"",0,null,"",0,null,""]
[399,null,null,null,null,null,1,{"$f":"IF(Etusivu!$C$20=\"kyllä\",24%,0%)","v":0.24},0,0,0,0,0,0,null,"",0,null,"",0,null,""]
[400,null,null,null,null,null,1,{"$f":"IF(Etusivu!$C$20=\"kyllä\",24%,0%)","v":0.24},0,0,0,0,0,0,null,"",0,null,"",0,null,""]
[401,null,null,null,null,null,1,{"$f":"IF(Etusivu!$C$20=\"kyllä\",24%,0%)","v":0.24},0,0,0,0,0,0,null,"",0,null,"",0,null,""]
[402,null,null,null,null,null,1,{"$f":"IF(Etusivu!$C$20=\"kyllä\",24%,0%)","v":0.24},0,0,0,0,0,0,null,"",0,null,"",0,null,""]
[403,null,null,null,null,null,1,{"$f":"IF(Etusivu!$C$20=\"kyllä\",24%,0%)","v":0.24},0,0,0,0,0,0,null,"",0,null,"",0,null,""]
[404,null,null,null,null,null,1,{"$f":"IF(Etusivu!$C$20=\"kyllä\",24%,0%)","v":0.24},0,0,0,0,0,0,null,"",0,null,"",0,null,""]
[405,null,null,null,null,null,1,{"$f":"IF(Etusivu!$C$20=\"kyllä\",24%,0%)","v":0.24},0,0,0,0,0,0,null,"",0,null,"",0,null,""]
[406,null,null,null,null,null,1,{"$f":"IF(Etusivu!$C$20=\"kyllä\",24%,0%)","v":0.24},0,0,0,0,0,0,null,"",0,null,"",0,null,""]
[407,null,null,null,null,null,1,{"$f":"IF(Etusivu!$C$20=\"kyllä\",24%,0%)","v":0.24},0,0,0,0,0,0,null,"",0,null,"",0,null,""]
[408,null,null,null,null,null,1,{"$f":"IF(Etusivu!$C$20=\"kyllä\",24%,0%)","v":0.24},0,0,0,0,0,0,null,"",0,null,"",0,null,""]
[409,null,null,null,null,null,1,{"$f":"IF(Etusivu!$C$20=\"kyllä\",24%,0%)","v":0.24},0,0,0,0,0,0,null,"",0,null,"",0,null,""]
[410,null,null,null,null,null,1,{"$f":"IF(Etusivu!$C$20=\"kyllä\",24%,0%)","v":0.24},0,0,0,0,0,0,null,"",0,null,"",0,null,""]
[411,null,null,null,null,null,1,{"$f":"IF(Etusivu!$C$20=\"kyllä\",24%,0%)","v":0.24},0,0,0,0,0,0,null,"",0,null,"",0,null,""]
[412,null,null,null,null,null,1,{"$f":"IF(Etusivu!$C$20=\"kyllä\",24%,0%)","v":0.24},0,0,0,0,0,0,null,"",0,null,"",0,null,""]
[413,null,null,null,null,null,1,{"$f":"IF(Etusivu!$C$20=\"kyllä\",24%,0%)","v":0.24},0,0,0,0,0,0,null,"",0,null,"",0,null,""]
[414,null,null,null,null,null,1,{"$f":"IF(Etusivu!$C$20=\"kyllä\",24%,0%)","v":0.24},0,0,0,0,0,0,null,"",0,null,"",0,null,""]
[415,null,null,null,null,null,1,{"$f":"IF(Etusivu!$C$20=\"kyllä\",24%,0%)","v":0.24},0,0,0,0,0,0,null,"",0,null,"",0,null,""]
[416,null,null,null,null,null,1,{"$f":"IF(Etusivu!$C$20=\"kyllä\",24%,0%)","v":0.24},0,0,0,0,0,0,null,"",0,null,"",0,null,""]
[417,null,null,null,null,null,1,{"$f":"IF(Etusivu!$C$20=\"kyllä\",24%,0%)","v":0.24},0,0,0,0,0,0,null,"",0,null,"",0,null,""]
[418,null,null,null,null,null,1,{"$f":"IF(Etusivu!$C$20=\"kyllä\",24%,0%)","v":0.24},0,0,0,0,0,0,null,"",0,null,"",0,null,""]
[419,null,null,null,null,null,1,{"$f":"IF(Etusivu!$C$20=\"kyllä\",24%,0%)","v":0.24},0,0,0,0,0,0,null,"",0,null,"",0,null,""]
[420,null,null,null,null,null,1,{"$f":"IF(Etusivu!$C$20=\"kyllä\",24%,0%)","v":0.24},0,0,0,0,0,0,null,"",0,null,"",0,null,""]

{"sheet":"Ajopäiv.","index":6,"n_rows":151,"n_cols":16,"rows_kept":151,"cut":false,"hidden":false,"merged":[[3,1,3,11],[4,1,4,11],[9,13,9,14],[8,13,8,14],[6,8,6,9],[6,10,6,11],[5,10,5,11],[7,4,7,5]]}
[null,"Mette 2016"]
[null,"Metsätalouden kirjanpito"]
[null,"Ajopäiväkirja"]
[null,{"$f":"Etusivu!C10","v":"RAJOITETTU TESTIVESIO"}]
[null,{"$f":"Etusivu!E10","v":"Testitila 1:45"}]
[null,null,null,null,null,"Kilometrikustannus ja päivärahat yhteensä",null,null,null,null,{"$f":"SUM(H8:L8)","v":31.44}]
[null,null,null,null,null,"Ajoneuvo- luokka","lisämat- kustajien määrä","Matkakulu","puolipäiväraha",null,"kokopäiväraha"]
[null,null,"ohje","Yhteensä     ",{"$f":"CONCATENATE(SUMIF(F10:F151,\">3\",E10:E151), \" km ja \", SUMIF(F10:F151,\"<4\",E10:E151), \" tuntia\")","v":"120 km ja 0 tuntia"},null,null,{"$f":"SUM(H10:H151)","v":31.44},null,{"$f":"SUM(J10:J151)","v":0},null,{"$f":"SUM(L10:L151)","v":0},null,"Päivärahat",null,"euroa/pv"]
[null,"Päiväys","selite",null,"km\ntai tuntia","ajoneuvo- luokka","lisähenkilö","koko summa\n€","kpl","koko summa\n€","kpl","koko summa\n€",null,"puolipäiväraha",null,14]
[null,"8.8.","Tietokoneen ostomatka","50 % metsälle",72,4,null,{"$f":"(((SUMIF(N$14:N$28,F10,P$14:P$28))+(G10*P$31))*E10)","v":18},null,{"$f":"I10*$P$9","v":0},null,{"$f":"K10*$P$10","v":0},null,"kokopäiväraha",null,26]
[null,"4.4.","metsätien loppukokous, Rouva mukana",null,48,4,1,13.44,null,0,null,{"$f":"K11*$P$10","v":0}]
[null,null,"^ ^",null,null,null,null,0,null,0,null,0,null,"Kilometrikorvaukset"]
[null,null,null,null,null,null,null,0,null,0,null,0,null,"ajoneuvoluokka",null,"euroa/km"]
[null,null,null,null,null,null,null,0,null,0,null,0,null,1,"mönkijä",14]
[null,null,null,null,null,null,null,0,null,0,null,0,null,2,"moottorikelkka",14]
[null,null,null,null,null,null,null,0,null,0,null,0,null,3,"Traktori",11]
[null,null,null,null,null,null,null,0,null,0,null,0,null,4,"henkilöauto",0.25]
[null,null,null,null,null,null,null,0,null,0,null,0,null,5,"mopo",0.09]
[null,null,null,null,null,null,null,0,null,0,null,0,null,6,"moottoripyörä",0.17]
[null,null,null,null,null,null,null,0,null,0,null,0,null,7,"moottorivene <50 hv"]
[null,null,null,null,null,null,null,0,null,0,null,0,null,8,"moottorivene >50 hv"]
[null,null,null,null,null,null,null,0,null,0,null,0,null,9,"auto + perävaunu",{"$f":"P17+0.07","v":0.32}]
[null,null,null,null,null,null,null,0,null,0,null,0,null,10,"auto + asuntovaunu",{"$f":"+P17+0.11","v":0.36}]
[null,null,null,null,null,null,null,0,null,0,null,0,null,11,"auto + taukotupa",{"$f":"+P17+0.21","v":0.46}]
[null,null,null,null,null,null,null,0,null,0,null,0,null,12,"auto + metsätie",{"$f":"+P17+0.09","v":0.34}]
[null,null,null,null,null,null,null,0,null,0,null,0,null,13,"auto + perävaunu+metsätie",{"$f":"+P17+0.07+0.09","v":0.41}]
[null,null,null,null,null,null,null,0,null,0,null,0,null,14,"auto + asuntovaunu+metsätie",{"$f":"+P17+0.11+0.09","v":0.45}]
[null,null,null,null,null,null,null,0,null,0,null,0,null,15,"auto + taukotupa+metsätie",{"$f":"+P17+0.21+0.09","v":0.55000000000000004}]
[null,null,null,null,null,null,null,0,null,0,null,0]
[null,null,null,null,null,null,null,0,null,0,null,0,null,null,null,"euroa/km/hlö"]
[null,null,null,null,null,null,null,0,null,0,null,0,null,null,"Lisämatkustaja",0.03]
[null,null,null,null,null,null,null,0,null,0,null,0]
[null,null,null,null,null,null,null,0,null,0,null,0]
[null,null,null,null,null,null,null,0,null,0,null,0]
[null,null,null,null,null,null,null,0,null,0,null,0]
[null,null,null,null,null,null,null,0,null,0,null,0]
[null,null,null,null,null,null,null,0,null,0,null,0]
[null,null,null,null,null,null,null,0,null,0,null,0]
[null,null,null,null,null,null,null,0,null,0,null,0]
[null,null,null,null,null,null,null,0,null,0,null,0]
[null,null,null,null,null,null,null,0,null,0,null,0]
[null,null,null,null,null,null,null,{"$f":"(((SUMIF(N$14:N$28,F42,P$14:P$28))+(G42*P$31))*E42)","v":0},null,{"$f":"I42*$P$9","v":0},null,0]
[null,null,null,null,null,null,null,0,null,0,null,0]
[null,null,null,null,null,null,null,0,null,0,null,0]
[null,null,null,null,null,null,null,0,null,0,null,0]
[null,null,null,null,null,null,null,0,null,0,null,0]
[null,null,null,null,null,null,null,0,null,0,null,0]
[null,null,null,null,null,null,null,0,null,0,null,0]
[null,null,null,null,null,null,null,0,null,0,null,0]
[null,null,null,null,null,null,null,0,null,0,null,0]
[null,null,null,null,null,null,null,0,null,0,null,{"$f":"K51*$P$10","v":0}]
[null,null,null,null,null,null,null,0,null,0,null,0]
[null,null,null,null,null,null,null,0,null,0,null,0]
[null,null,null,null,null,null,null,0,null,0,null,0]
[null,null,null,null,null,null,null,0,null,0,null,0]
[null,null,null,null,null,null,null,0,null,0,null,0]
[null,null,null,null,null,null,null,0,null,0,null,0]
[null,null,null,null,null,null,null,0,null,0,null,0]
[null,null,null,null,null,null,null,0,null,0,null,0]
[null,null,null,null,null,null,null,0,null,0,null,0]
[null,null,null,null,null,null,null,0,null,0,null,0]
[null,null,null,null,null,null,null,0,null,0,null,0]
[null,null,null,null,null,null,null,0,null,0,null,0]
[null,null,null,null,null,null,null,0,null,0,null,0]
[null,null,null,null,null,null,null,0,null,0,null,0]
[null,null,null,null,null,null,null,0,null,0,null,0]
[null,null,null,null,null,null,null,0,null,0,null,0]
[null,null,null,null,null,null,null,0,null,0,null,0]
[null,null,null,null,null,null,null,0,null,0,null,0]
[null,null,null,null,null,null,null,0,null,0,null,0]
[null,null,null,null,null,null,null,0,null,0,null,0]
[null,null,null,null,null,null,null,0,null,0,null,0]
[null,null,null,null,null,null,null,0,null,0,null,0]
[null,null,null,null,null,null,null,{"$f":"(((SUMIF(N$14:N$28,F74,P$14:P$28))+(G74*P$31))*E74)","v":0},null,{"$f":"I74*$P$9","v":0},null,0]
[null,null,null,null,null,null,null,0,null,0,null,0]
[null,null,null,null,null,null,null,0,null,0,null,0]
[null,null,null,null,null,null,null,0,null,0,null,0]
[null,null,null,null,null,null,null,0,null,0,null,0]
[null,null,null,null,null,null,null,0,null,0,null,0]
[null,null,null,null,null,null,null,0,null,0,null,0]
[null,null,null,null,null,null,null,0,null,0,null,0]
[null,null,null,null,null,null,null,0,null,0,null,0]
[null,null,null,null,null,null,null,0,null,0,null,0]
[null,null,null,null,null,null,null,0,null,0,null,0]
[null,null,null,null,null,null,null,0,null,0,null,0]
[null,null,null,null,null,null,null,0,null,0,null,0]
[null,null,null,null,null,null,null,0,null,0,null,0]
[null,null,null,null,null,null,null,0,null,0,null,0]
[null,null,null,null,null,null,null,0,null,0,null,0]
[null,null,null,null,null,null,null,0,null,0,null,0]
[null,null,null,null,null,null,null,0,null,0,null,0]
[null,null,null,null,null,null,null,0,null,0,null,0]
[null,null,null,null,null,null,null,0,null,0,null,0]
[null,null,null,null,null,null,null,0,null,0,null,0]
[null,null,null,null,null,null,null,0,null,0,null,0]
[null,null,null,null,null,null,null,0,null,0,null,0]
[null,null,null,null,null,null,null,0,null,0,null,0]
[null,null,null,null,null,null,null,0,null,0,null,0]
[null,null,null,null,null,null,null,0,null,0,null,0]
[null,null,null,null,null,null,null,0,null,0,null,0]
[null,null,null,null,null,null,null,0,null,0,null,0]
[null,null,null,null,null,null,null,0,null,0,null,0]
[null,null,null,null,null,null,null,0,null,0,null,0]
[null,null,null,null,null,null,null,0,null,0,null,0]
[null,null,null,null,null,null,null,0,null,0,null,0]
[null,null,null,null,null,null,null,{"$f":"(((SUMIF(N$14:N$28,F106,P$14:P$28))+(G106*P$31))*E106)","v":0},null,{"$f":"I106*$P$9","v":0},null,0]
[null,null,null,null,null,null,null,0,null,0,null,0]
[null,null,null,null,null,null,null,0,null,0,null,0]
[null,null,null,null,null,null,null,0,null,0,null,0]
[null,null,null,null,null,null,null,0,null,0,null,0]
[null,null,null,null,null,null,null,0,null,0,null,0]
[null,null,null,null,null,null,null,0,null,0,null,0]
[null,null,null,null,null,null,null,0,null,0,null,0]
[null,null,null,null,null,null,null,0,null,0,null,0]
[null,null,null,null,null,null,null,0,null,0,null,0]
[null,null,null,null,null,null,null,0,null,0,null,0]
[null,null,null,null,null,null,null,0,null,0,null,0]
[null,null,null,null,null,null,null,0,null,0,null,0]
[null,null,null,null,null,null,null,0,null,0,null,0]
[null,null,null,null,null,null,null,0,null,0,null,0]
[null,null,null,null,null,null,null,0,null,0,null,0]
[null,null,null,null,null,null,null,0,null,0,null,0]
[null,null,null,null,null,null,null,0,null,0,null,0]
[null,null,null,null,null,null,null,0,null,0,null,0]
[null,null,null,null,null,null,null,0,null,0,null,{"$f":"K125*$P$10","v":0}]
[null,null,null,null,null,null,null,0,null,0,null,0]
[null,null,null,null,null,null,null,0,null,0,null,0]
[null,null,null,null,null,null,null,0,null,0,null,0]
[null,null,null,null,null,null,null,0,null,0,null,0]
[null,null,null,null,null,null,null,0,null,0,null,0]
[null,null,null,null,null,null,null,0,null,0,null,0]
[null,null,null,null,null,null,null,0,null,0,null,0]
[null,null,null,null,null,null,null,0,null,0,null,0]
[null,null,null,null,null,null,null,0,null,0,null,0]
[null,null,null,null,null,null,null,0,null,0,null,0]
[null,null,null,null,null,null,null,0,null,0,null,0]
[null,null,null,null,null,null,null,0,null,0,null,0]
[null,null,null,null,null,null,null,{"$f":"(((SUMIF(N$14:N$28,F138,P$14:P$28))+(G138*P$31))*E138)","v":0},null,{"$f":"I138*$P$9","v":0},null,0]
[null,null,null,null,null,null,null,0,null,0,null,0]
[null,null,null,null,null,null,null,0,null,0,null,0]
[null,null,null,null,null,null,null,0,null,0,null,0]
[null,null,null,null,null,null,null,0,null,0,null,0]
[null,null,null,null,null,null,null,0,null,0,null,0]
[null,null,null,null,null,null,null,0,null,0,null,0]
[null,null,null,null,null,null,null,0,null,0,null,0]
[null,null,null,null,null,null,null,0,null,0,null,0]
[null,null,null,null,null,null,null,0,null,0,null,0]
[null,null,null,null,null,null,null,0,null,0,null,0]
[null,null,null,null,null,null,null,0,null,0,null,0]
[null,null,null,null,null,null,null,0,null,0,null,0]
[null,null,null,null,null,null,null,0,null,0,null,0]

{"sheet":"Arvionvaraiset","index":7,"n_rows":35,"n_cols":28,"rows_kept":35,"cut":false,"hidden":false,"merged":[[26,26,26,27],[26,19,26,20],[29,1,30,12],[6,22,6,27],[3,1,3,13],[4,1,4,13],[26,5,26,6],[26,1,27,3],[26,12,26,13],[8,1,8,2],[8,8,8,9],[8,15,8,16],[8,22,8,23]]}
[null,"Mette 2016"]
[null,"Metsätalouden kirjanpito",null,null,null,null,null,null,null,null,null,null,null,"Ohje"]
[null,"Arvionvaraiset"]
[null,{"$f":"Etusivu!C10","v":"RAJOITETTU TESTIVESIO"}]
[null,{"$f":"Etusivu!E10","v":"Testitila 1:45"}]
[]
[null,"Matkapuhelinkulut",null,null,null,null,null,null,"Puhelin- ja tietotekniikan kulut",null,null,null,null,null,null,"Sähkökulut",null,null,null,null,null,null,"Nimeä itse"]
[null,"DNA",null,null,null,null,null,null,null,null,null,null,null,null,null,"Sähkön käyttöpaikka"]
[null,"päiväys",null,null,null,null,null,null,"päiväys",null,null,null,null,null,null,"päiväys",null,null,null,null,null,null,"päiväys"]
[null,"pv","kk","Summa (sis. alv)","Alv %","Alv","Euroa Alv 0 %",null,"pv","kk","Summa (sis. alv)","Alv %","Alv","Euroa Alv 0 %",null,"pv","kk","Summa (sis. alv)","Alv %","Alv","Euroa Alv 0 %",null,"pv","kk","Summa (sis. alv)","Alv %","Alv","Euroa Alv 0 %"]
[null,1,2,67,{"$f":"IF(Etusivu!$C$20=\"kyllä\",24%,0%)","v":0.24},{"$f":"+D11-G11","v":12.97},{"$f":"+D11/(1+E11)","v":54.03},null,null,null,null,{"$f":"IF(Etusivu!$C$20=\"kyllä\",24%,0%)","v":0.24},{"$f":"+K11-N11","v":0},{"$f":"+K11/(1+L11)","v":0},null,null,null,null,{"$f":"IF(Etusivu!$C$20=\"kyllä\",24%,0%)","v":0.24},{"$f":"+R11-U11","v":0},{"$f":"+R11/(1+S11)","v":0},null,null,null,null,{"$f":"IF(Etusivu!$C$20=\"kyllä\",24%,0%)","v":0.24},{"$f":"+Y11-AB11","v":0},{"$f":"+Y11/(1+Z11)","v":0}]
[null,1,4,74,{"$f":"IF(Etusivu!$C$20=\"kyllä\",24%,0%)","v":0.24},{"$f":"+D12-G12","v":14.32},59.68,null,null,null,null,{"$f":"IF(Etusivu!$C$20=\"kyllä\",24%,0%)","v":0.24},{"$f":"+K12-N12","v":0},{"$f":"+K12/(1+L12)","v":0},null,null,null,null,{"$f":"IF(Etusivu!$C$20=\"kyllä\",24%,0%)","v":0.24},{"$f":"+R12-U12","v":0},{"$f":"+R12/(1+S12)","v":0},null,null,null,null,{"$f":"IF(Etusivu!$C$20=\"kyllä\",24%,0%)","v":0.24},{"$f":"+Y12-AB12","v":0},{"$f":"+Y12/(1+Z12)","v":0}]
[null,1,6,44,{"$f":"IF(Etusivu!$C$20=\"kyllä\",24%,0%)","v":0.24},8.52,35.479999999999997,null,null,null,null,{"$f":"IF(Etusivu!$C$20=\"kyllä\",24%,0%)","v":0.24},0,0,null,null,null,null,{"$f":"IF(Etusivu!$C$20=\"kyllä\",24%,0%)","v":0.24},0,0,null,null,null,null,{"$f":"IF(Etusivu!$C$20=\"kyllä\",24%,0%)","v":0.24},0,0]
[null,1,8,55,{"$f":"IF(Etusivu!$C$20=\"kyllä\",24%,0%)","v":0.24},10.65,44.35,null,null,null,null,{"$f":"IF(Etusivu!$C$20=\"kyllä\",24%,0%)","v":0.24},0,0,null,null,null,null,{"$f":"IF(Etusivu!$C$20=\"kyllä\",24%,0%)","v":0.24},0,0,null,null,null,null,{"$f":"IF(Etusivu!$C$20=\"kyllä\",24%,0%)","v":0.24},0,0]
[null,1,10,50,{"$f":"IF(Etusivu!$C$20=\"kyllä\",24%,0%)","v":0.24},9.68,40.32,null,null,null,null,{"$f":"IF(Etusivu!$C$20=\"kyllä\",24%,0%)","v":0.24},0,0,null,null,null,null,{"$f":"IF(Etusivu!$C$20=\"kyllä\",24%,0%)","v":0.24},0,0,null,null,null,null,{"$f":"IF(Etusivu!$C$20=\"kyllä\",24%,0%)","v":0.24},0,0]
[null,1,12,33,{"$f":"IF(Etusivu!$C$20=\"kyllä\",24%,0%)","v":0.24},6.39,26.61,null,null,null,null,{"$f":"IF(Etusivu!$C$20=\"kyllä\",24%,0%)","v":0.24},0,0,null,null,null,null,{"$f":"IF(Etusivu!$C$20=\"kyllä\",24%,0%)","v":0.24},0,0,null,null,null,null,{"$f":"IF(Etusivu!$C$20=\"kyllä\",24%,0%)","v":0.24},0,0]
[null,null,null,null,{"$f":"IF(Etusivu!$C$20=\"kyllä\",24%,0%)","v":0.24},0,0,null,null,null,null,{"$f":"IF(Etusivu!$C$20=\"kyllä\",24%,0%)","v":0.24},0,0,null,null,null,null,{"$f":"IF(Etusivu!$C$20=\"kyllä\",24%,0%)","v":0.24},0,0,null,null,null,null,{"$f":"IF(Etusivu!$C$20=\"kyllä\",24%,0%)","v":0.24},0,0]
[null,null,null,null,{"$f":"IF(Etusivu!$C$20=\"kyllä\",24%,0%)","v":0.24},0,0,null,null,null,null,{"$f":"IF(Etusivu!$C$20=\"kyllä\",24%,0%)","v":0.24},0,0,null,null,null,null,{"$f":"IF(Etusivu!$C$20=\"kyllä\",24%,0%)","v":0.24},0,0,null,null,null,null,{"$f":"IF(Etusivu!$C$20=\"kyllä\",24%,0%)","v":0.24},0,0]
[null,null,null,null,{"$f":"IF(Etusivu!$C$20=\"kyllä\",24%,0%)","v":0.24},0,0,null,null,null,null,{"$f":"IF(Etusivu!$C$20=\"kyllä\",24%,0%)","v":0.24},0,0,null,null,null,null,{"$f":"IF(Etusivu!$C$20=\"kyllä\",24%,0%)","v":0.24},0,0,null,null,null,null,{"$f":"IF(Etusivu!$C$20=\"kyllä\",24%,0%)","v":0.24},0,0]
[null,null,null,null,{"$f":"IF(Etusivu!$C$20=\"kyllä\",24%,0%)","v":0.24},0,0,null,null,null,null,{"$f":"IF(Etusivu!$C$20=\"kyllä\",24%,0%)","v":0.24},0,0,null,null,null,null,{"$f":"IF(Etusivu!$C$20=\"kyllä\",24%,0%)","v":0.24},0,0,null,null,null,null,{"$f":"IF(Etusivu!$C$20=\"kyllä\",24%,0%)","v":0.24},0,0]
[null,null,null,null,{"$f":"IF(Etusivu!$C$20=\"kyllä\",24%,0%)","v":0.24},0,0,null,null,null,null,{"$f":"IF(Etusivu!$C$20=\"kyllä\",24%,0%)","v":0.24},0,0,null,null,null,null,{"$f":"IF(Etusivu!$C$20=\"kyllä\",24%,0%)","v":0.24},0,0,null,null,null,null,{"$f":"IF(Etusivu!$C$20=\"kyllä\",24%,0%)","v":0.24},0,0]
[null,null,null,null,{"$f":"IF(Etusivu!$C$20=\"kyllä\",24%,0%)","v":0.24},0,0,null,null,null,null,{"$f":"IF(Etusivu!$C$20=\"kyllä\",24%,0%)","v":0.24},0,0,null,null,null,null,{"$f":"IF(Etusivu!$C$20=\"kyllä\",24%,0%)","v":0.24},0,0,null,null,null,null,{"$f":"IF(Etusivu!$C$20=\"kyllä\",24%,0%)","v":0.24},0,0]
[null,null,null,null,{"$f":"IF(Etusivu!$C$20=\"kyllä\",24%,0%)","v":0.24},0,0,null,null,null,null,{"$f":"IF(Etusivu!$C$20=\"kyllä\",24%,0%)","v":0.24},0,0,null,null,null,null,{"$f":"IF(Etusivu!$C$20=\"kyllä\",24%,0%)","v":0.24},0,0,null,null,null,null,{"$f":"IF(Etusivu!$C$20=\"kyllä\",24%,0%)","v":0.24},0,0]
[null,"yhteensä",null,null,null,{"$f":"SUM(F11:F23)","v":62.53},{"$f":"SUM(G11:G23)","v":260.47000000000003},null,"yhteensä",null,null,null,{"$f":"SUM(M11:M23)","v":0},{"$f":"SUM(N11:N23)","v":0},null,"yhteensä",null,null,null,{"$f":"SUM(T11:T23)","v":0},{"$f":"SUM(U11:U23)","v":0},null,"yhteensä",null,null,null,{"$f":"SUM(AA11:AA23)","v":0},{"$f":"SUM(AB11:AB23)","v":0}]
[null,"€/kk Alv 0%",null,null,null,null,{"$f":"+G24/12","v":21.71},null,"€/kk Alv 0%",null,null,null,null,{"$f":"+N24/12","v":0},null,"€/kk Alv 0%",null,null,null,null,{"$f":"+U24/12","v":0},null,"€/kk Alv 0%",null,null,null,null,{"$f":"+AB24/12","v":0}]
[]
[null,"Metsätalouden osuus",null,null,null,0.25,null,null,null,null,null,null,0.1,null,null,null,null,null,null,0.1,null,null,null,null,null,null,0.5]
[null,null,null,null,null,{"$f":"+F24*F27","v":15.63},{"$f":"+F27*G24","v":65.12},null,null,null,null,null,{"$f":"+M24*M27","v":0},{"$f":"+M27*N24","v":0},null,null,null,null,null,{"$f":"+T27*T24","v":0},{"$f":"+T27*U24","v":0},null,null,null,null,null,{"$f":"+AA27*AA24","v":0},{"$f":"+AA27*AB24","v":0}]
[]
[null,"Työhuonevähennys: Jos selvitystä todellisista kuluista ei ole, mutta harjoitetun metsätalouden laajuus ja työhuonetilan tarve huomioon ottaen kuluja voidaan katsoa syntyneen, arvioituna kuluna voidaan muun selvityksen puuttuessa vähentää palkansaajan satunnaisten sivutulojen työhuonevähennyksen mukainen määrä (205 €/v). ",null,null,null,null,null,null,null,null,null,null,null,"Euroa Alv 0 %"]
[null,null,null,null,null,null,null,null,null,null,null,null,null,205]
[]
[null,"Arvionvaraiset yhteensä"]
[null,"Metsätaloudessa vähennyskelpoinen alv",null,null,null,null,{"$f":"+F28+M28+T28+AA28","v":15.63}]
[null,"Metsätaloudessa vähennyskelpoinen meno",null,null,null,null,{"$f":"+G28+N28+U28+AB28+N31","v":270.12}]

{"sheet":"Poistot","index":8,"n_rows":59,"n_cols":14,"rows_kept":59,"cut":false,"hidden":false,"merged":[[3,0,3,9],[4,0,4,9],[5,6,6,6],[4,10,5,12]]}
["Mette 2016"]
["METSÄTALOUDEN KIRJANPITO"]
["Poistojen laskenta",null,null,null,"Ohje","Ohje"]
[{"$f":"Etusivu!C10","v":"RAJOITETTU TESTIVESIO"}]
[{"$f":"Etusivu!E10","v":"Testitila 1:45"},null,null,null,null,null,null,null,null,null,"11.  Muistiinpanoihin (Poistoihin) sisältyvät \nmuun toiminnan menot (alv 0%)"]
[null,null,null,"Menojäännös","Lisäykset","Vähennykset","Poisto \n%","Poisto","Menojäännös"]
[null,null,null,{"$f":"CONCATENATE(\"1.1. \",Etusivu!C9)","v":"1.1. 2016"},"verovuonna","verovuonna",null,"€",{"$f":"CONCATENATE(\"31.12. \",Etusivu!C9)","v":"31.12. 2016"},null,"11.1 Maatalous","11.2 Elinkeinotoiminta","11.3 Yksityismenot"," "]
[null," nro","Koneet ja laitteet, yhteensä",{"$f":"SUM(D9:D28)","v":2500},{"$f":"SUM(E9:E28)","v":629.03},{"$f":"SUM(F9:F28)","v":0},null,{"$f":"SUM(H9:H28)","v":782.26},{"$f":"D8+E8-F8-H8","v":2346.77},null,{"$f":"SUM(K9:K28)","v":0},{"$f":"SUM(L9:L28)","v":0},{"$f":"SUM(M9:M28)","v":0}]
[null,1,"Metsäperäkärry",2500,{"$f":"SUMIF(Menot!O$12:O$232,B9,Menot!N$12:N$232)","v":0},null,0.25,{"$f":"IF((E9+D9-F9)<200.01,E9+D9-F9,(D9+E9-F9)*G9)","v":625},{"$f":"D9+E9-F9-H9","v":1875}]
[null,2,"Raivaussaha",null,{"$f":"SUMIF(Menot!O$12:O$232,B10,Menot!N$12:N$232)","v":629.03},null,0.25,{"$f":"IF((E10+D10-F10)<200.01,E10+D10-F10,(D10+E10-F10)*G10)","v":157.26},{"$f":"D10+E10-F10-H10","v":471.77}]
[null,3,null,null,{"$f":"SUMIF(Menot!O$12:O$232,B11,Menot!N$12:N$232)","v":0},null,0.25,{"$f":"IF((E11+D11-F11)<200.01,E11+D11-F11,(D11+E11-F11)*G11)","v":0},{"$f":"D11+E11-F11-H11","v":0}]
[null,4,null,null,{"$f":"SUMIF(Menot!O$12:O$232,B12,Menot!N$12:N$232)","v":0},null,0.25,0,0]
[null,5,null,null,{"$f":"SUMIF(Menot!O$12:O$232,B13,Menot!N$12:N$232)","v":0},null,0.25,0,0]
[null,6,null,null,{"$f":"SUMIF(Menot!O$12:O$232,B14,Menot!N$12:N$232)","v":0},null,0.25,0,0]
[null,7,null,null,{"$f":"SUMIF(Menot!O$12:O$232,B15,Menot!N$12:N$232)","v":0},null,0.25,0,0]
[null,8,null,null,{"$f":"SUMIF(Menot!O$12:O$232,B16,Menot!N$12:N$232)","v":0},null,0.25,0,0]
[null,9,null,null,{"$f":"SUMIF(Menot!O$12:O$232,B17,Menot!N$12:N$232)","v":0},null,0.25,0,0]
[null,10,null,null,{"$f":"SUMIF(Menot!O$12:O$232,B18,Menot!N$12:N$232)","v":0},null,0.25,0,0]
[null,11,null,null,{"$f":"SUMIF(Menot!O$12:O$232,B19,Menot!N$12:N$232)","v":0},null,0.25,0,0]
[null,12,null,null,{"$f":"SUMIF(Menot!O$12:O$232,B20,Menot!N$12:N$232)","v":0},null,0.25,0,0]
[null,13,null,null,{"$f":"SUMIF(Menot!O$12:O$232,B21,Menot!N$12:N$232)","v":0},null,0.25,0,0]
[null,14,null,null,{"$f":"SUMIF(Menot!O$12:O$232,B22,Menot!N$12:N$232)","v":0},null,0.25,0,0]
[null,15,null,null,{"$f":"SUMIF(Menot!O$12:O$232,B23,Menot!N$12:N$232)","v":0},null,0.25,0,0]
[null,16,null,null,{"$f":"SUMIF(Menot!O$12:O$232,B24,Menot!N$12:N$232)","v":0},null,0.25,0,0]
[null,17,null,null,{"$f":"SUMIF(Menot!O$12:O$232,B25,Menot!N$12:N$232)","v":0},null,0.25,0,0]
[null,18,null,null,{"$f":"SUMIF(Menot!O$12:O$232,B26,Menot!N$12:N$232)","v":0},null,0.25,0,0]
[null,19,null,null,{"$f":"SUMIF(Menot!O$12:O$232,B27,Menot!N$12:N$232)","v":0},null,0.25,0,0]
[null,20,null,null,{"$f":"SUMIF(Menot!O$12:O$232,B28,Menot!N$12:N$232)","v":0},null,0.25,0,0]
[]
[null," nro","Rakennukset, yhteensä",{"$f":"SUM(D31:D35)","v":0},{"$f":"SUM(E31:E35)","v":0},{"$f":"SUM(F31:F35)","v":0},null,{"$f":"SUM(H31:H35)","v":0},{"$f":"D30+E30-F30-H30","v":0},null,{"$f":"SUM(K31:K35)","v":0},{"$f":"SUM(L31:L35)","v":0},{"$f":"SUM(M31:M35)","v":0}]
[null,1,null,null,{"$f":"SUMIF(Menot!R$12:R$232,B31,Menot!Q$12:Q$232)","v":0},null,0.1,{"$f":"IF((E31+D31-F31)<200.01,E31+D31-F31,(D31+E31-F31)*G31)","v":0},0]
[null,2,null,null,{"$f":"SUMIF(Menot!R$12:R$232,B32,Menot!Q$12:Q$232)","v":0},null,0.1,{"$f":"IF((E32+D32-F32)<200.01,E32+D32-F32,(D32+E32-F32)*G32)","v":0},0]
[null,3,null,null,{"$f":"SUMIF(Menot!R$12:R$232,B33,Menot!Q$12:Q$232)","v":0},null,0.1,{"$f":"IF((E33+D33-F33)<200.01,E33+D33-F33,(D33+E33-F33)*G33)","v":0},0]
[null,4,null,null,{"$f":"SUMIF(Menot!R$12:R$232,B34,Menot!Q$12:Q$232)","v":0},null,0.1,{"$f":"IF((E34+D34-F34)<200.01,E34+D34-F34,(D34+E34-F34)*G34)","v":0},0]
[null,5,null,null,{"$f":"SUMIF(Menot!R$12:R$232,B35,Menot!Q$12:Q$232)","v":0},null,0.1,{"$f":"IF((E35+D35-F35)<200.01,E35+D35-F35,(D35+E35-F35)*G35)","v":0},0]
[]
[null," nro","Ojat ja tiet, yhteensä",{"$f":"SUM(D38:D57)","v":0},{"$f":"SUM(E38:E57)","v":1935.48},{"$f":"SUM(F38:F57)","v":0},null,{"$f":"SUM(H38:H57)","v":290.32},{"$f":"D37+E37-F37-H37","v":1645.16},null,{"$f":"SUM(K38:K57)","v":0},{"$f":"SUM(L38:L57)","v":0},{"$f":"SUM(M38:M57)","v":0}]
[null,1,"Peräkyläntie",null,{"$f":"SUMIF(Menot!U$12:U$232,B38,Menot!T$12:T$232)","v":1935.48},null,0.15,{"$f":"IF((E38+D38-F38)<200.01,E38+D38-F38,(D38+E38-F38)*G38)","v":290.32},{"$f":"D38+E38-F38-H38","v":1645.16}]
[null,2,null,null,{"$f":"SUMIF(Menot!U$12:U$232,B39,Menot!T$12:T$232)","v":0},null,0.15,{"$f":"IF((E39+D39-F39)<200.01,E39+D39-F39,(D39+E39-F39)*G39)","v":0},{"$f":"D39+E39-F39-H39","v":0}]
[null,3,null,null,{"$f":"SUMIF(Menot!U$12:U$232,B40,Menot!T$12:T$232)","v":0},null,0.15,0,0]
[null,4,null,null,{"$f":"SUMIF(Menot!U$12:U$232,B41,Menot!T$12:T$232)","v":0},null,0.15,0,0]
[null,5,null,null,{"$f":"SUMIF(Menot!U$12:U$232,B42,Menot!T$12:T$232)","v":0},null,0.15,0,0]
[null,6,null,null,{"$f":"SUMIF(Menot!U$12:U$232,B43,Menot!T$12:T$232)","v":0},null,0.15,0,0]
[null,7,null,null,{"$f":"SUMIF(Menot!U$12:U$232,B44,Menot!T$12:T$232)","v":0},null,0.15,{"$f":"IF((E44+D44-F44)<200.01,E44+D44-F44,(D44+E44-F44)*G44)","v":0},{"$f":"D44+E44-F44-H44","v":0}]
[null,8,null,null,{"$f":"SUMIF(Menot!U$12:U$232,B45,Menot!T$12:T$232)","v":0},null,0.15,0,0]
[null,9,null,null,{"$f":"SUMIF(Menot!U$12:U$232,B46,Menot!T$12:T$232)","v":0},null,0.15,0,0]
[null,10,null,null,{"$f":"SUMIF(Menot!U$12:U$232,B47,Menot!T$12:T$232)","v":0},null,0.15,0,0]
[null,11,null,null,{"$f":"SUMIF(Menot!U$12:U$232,B48,Menot!T$12:T$232)","v":0},null,0.15,0,0]
[null,12,null,null,{"$f":"SUMIF(Menot!U$12:U$232,B49,Menot!T$12:T$232)","v":0},null,0.15,0,0]
[null,13,null,null,{"$f":"SUMIF(Menot!U$12:U$232,B50,Menot!T$12:T$232)","v":0},null,0.15,0,0]
[null,14,null,null,{"$f":"SUMIF(Menot!U$12:U$232,B51,Menot!T$12:T$232)","v":0},null,0.15,0,0]
[null,15,null,null,{"$f":"SUMIF(Menot!U$12:U$232,B52,Menot!T$12:T$232)","v":0},null,0.15,0,0]
[null,16,null,null,{"$f":"SUMIF(Menot!U$12:U$232,B53,Menot!T$12:T$232)","v":0},null,0.15,0,0]
[null,17,null,null,{"$f":"SUMIF(Menot!U$12:U$232,B54,Menot!T$12:T$232)","v":0},null,0.15,0,0]
[null,18,null,null,{"$f":"SUMIF(Menot!U$12:U$232,B55,Menot!T$12:T$232)","v":0},null,0.15,0,0]
[null,19,null,null,{"$f":"SUMIF(Menot!U$12:U$232,B56,Menot!T$12:T$232)","v":0},null,0.15,0,0]
[null,20,null,null,{"$f":"SUMIF(Menot!U$12:U$232,B57,Menot!T$12:T$232)","v":0},null,0.15,0,0]
[]
[null,null,"Ohjelma poistaa enintään 200 euron menon tai menojäännöksen kerralla. "]

{"sheet":"Velat","index":9,"n_rows":71,"n_cols":12,"rows_kept":71,"cut":false,"hidden":false,"merged":[[4,1,4,11],[5,1,5,11],[13,7,15,11]]}
[null,"Mette 2016"]
[null,{"$f":"Tulot!A2","v":"Metsätalouden kirjanpito"}]
[null,"Velat ja korot"]
[null,"YHTYMÄT EIVÄT TÄYTÄ TÄTÄ LOMAKETTA"]
[null,{"$f":"Etusivu!C10","v":"RAJOITETTU TESTIVESIO"}]
[null,{"$f":"Etusivu!E10","v":"Testitila 1:45"}]
[]
[]
[null,"Velan nimi","Laina 1",null,null,null,null,"Lainat yhteensä"]
[null,"Velan määrä vuoden alussa",null,null,0,"euroa",null,"Velan määrä vuoden alussa",null,null,{"$f":"E10+E32+E53","v":0},"euroa"]
[null,"Velan määrä vuoden lopussa",null,null,{"$f":"E10-D28","v":0},"euroa",null,"Velan määrä vuoden lopussa",null,null,{"$f":"E11+E33+E54","v":0},"euroa"]
[null,null,null,null,null,null,null,"Korot yhteensä",null,null,{"$f":"C28+C50+C71","v":0},"euroa"]
[null,"Lainan maksut"]
[null,"Päivä","korko","lyhennys","yhteensä",null,null,"Metsätalouden harjoittamiseen liittyvät velat ja niistä maksetut korot ilmoitetaan esitäytetyllä veroilmoituksella. "]
[null,null,null,null,{"$f":"IF(C15+D15>0,C15+D15,\"\")","v":""}]
[null,null,null,null,""]
[null,null,null,null,""]
[null,null,null,null,""]
[null,null,null,null,""]
[null,null,null,null,""]
[null,null,null,null,""]
[null,null,null,null,""]
[null,null,null,null,""]
[null,null,null,null,""]
[null,null,null,null,""]
[null,null,null,null,""]
[null,"YHTEENSÄ",{"$f":"IF(SUM(C15:C26)>0,SUM(C15:C26),\"\")","v":""},{"$f":"IF(SUM(D15:D26)>0,SUM(D15:D26),\"\")","v":""}]
[null,null,{"$f":"IF(C27>0,SUM(C15:C26),0)","v":0},{"$f":"IF(D27>0,SUM(D15:D26),0)","v":0}]
[]
[]
[null,"Velan nimi","Laina 2"]
[null,"Velan määrä vuoden alussa",null,null,0,"euroa"]
[null,"Velan määrä vuoden lopussa",null,null,{"$f":"E32-D50","v":0},"euroa"]
[]
[null,"Lainan maksut"]
[null,"Päivä","korko","lyhennys","yhteensä"]
[null,null,null,null,{"$f":"IF(C37+D37>0,C37+D37,\"\")","v":""}]
[null,null,null,null,""]
[null,null,null,null,""]
[null,null,null,null,""]
[null,null,null,null,""]
[null,null,null,null,""]
[null,null,null,null,""]
[null,null,null,null,""]
[null,null,null,null,""]
[null,null,null,null,""]
[null,null,null,null,""]
[null,null,null,null,""]
[null,"YHTEENSÄ",{"$f":"IF(SUM(C37:C48)>0,SUM(C37:C48),\"\")","v":""},{"$f":"IF(SUM(D37:D48)>0,SUM(D37:D48),\"\")","v":""}]
[null,null,{"$f":"IF(C49>0,SUM(C37:C48),0)","v":0},{"$f":"IF(D49>0,SUM(D37:D48),0)","v":0}]
[]
[null,"Velan nimi","Laina 3"]
[null,"Velan määrä vuoden alussa",null,null,0,"euroa"]
[null,"Velan määrä vuoden lopussa",null,null,{"$f":"E53-D71","v":0},"euroa"]
[]
[null,"Lainan maksut"]
[null,"Päivä","korko","lyhennys","yhteensä"]
[null,null,null,null,{"$f":"IF(C58+D58>0,C58+D58,\"\")","v":""}]
[null,null,null,null,""]
[null,null,null,null,""]
[null,null,null,null,""]
[null,null,null,null,""]
[null,null,null,null,""]
[null,null,null,null,""]
[null,null,null,null,""]
[null,null,null,null,""]
[null,null,null,null,""]
[null,null,null,null,""]
[null,null,null,null,""]
[null,"YHTEENSÄ",{"$f":"IF(SUM(C58:C69)>0,SUM(C58:C69),\"\")","v":""},{"$f":"IF(SUM(D58:D69)>0,SUM(D58:D69),\"\")","v":""}]
[null,null,{"$f":"IF(C70>0,SUM(C58:C69),0)","v":0},{"$f":"IF(D70>0,SUM(D58:D69),0)","v":0}]

{"sheet":"Luovutusv.","index":10,"n_rows":21,"n_cols":9,"rows_kept":21,"cut":false,"hidden":false,"merged":[[20,1,20,8],[3,0,3,8],[4,0,4,8],[5,2,5,3],[18,1,18,8],[5,6,6,6],[5,5,6,5]]}
["Mette 2016"]
[{"$f":"Tulot!A2","v":"Metsätalouden kirjanpito"}]
["Metsätilan, koneiden ja kaluston luovutusvoitot"]
[{"$f":"Etusivu!C10","v":"RAJOITETTU TESTIVESIO"}]
[{"$f":"Etusivu!E10","v":"Testitila 1:45"}]
[null,"Luovutuksen kohde","päiväys",null,"luovutus-","Hankintameno, hankintameno- olettama \ntai poistamaton hankintameno","Lisätään tehdyn metsävähennyksen määrä metsätilan myynnissä","Luovutus-","ALV"]
[null,null,"pv","kk","hinta",null,null,"voitto"]
[null,"Valmetin myynti",9,9,14000,{"$f":"E8*0.4","v":5600},null,{"$f":"E8-F8+G8","v":8400},{"$f":"H8*0.24","v":2016}]
[null,null,null,null,null,null,null,0]
[null,null,null,null,null,null,null,0]
[null,null,null,null,null,null,null,0]
[null,null,null,null,null,null,null,0]
[null,null,null,null,null,null,null,0]
[null,null,null,null,null,null,null,0]
[null,null,null,null,null,null,null,0]
[null,"Yhteensä",null,null,{"$f":"SUM(E8:E15)","v":14000},{"$f":"SUM(F8:F15)","v":5600},{"$f":"SUM(G8:G15)","v":0},{"$f":"SUM(H8:H15)","v":8400},{"$f":"SUM(I8:I15)","v":2016}]
[]
[]
[null,"Siirrä luovutuksen kohteen poistamaton hankintameno poistot-taulukon kyseisen kohteen sarakkeeseen \"Vähennykset verovuonna\". "]
[]
[null,"Huom! Metsätilan, metsätalouden koneiden, laitteiden, rakennusten ja rakennelmien myynnistä saadut voitot verotetaan luovutusvoittoina. Luovutusvoitto on pääomatuloa, mutta ei metsätalouden pääomatuloa. Luovutusvoitot ilmoitetaan verolomakkeella 9. \nAlle 1000 euron luovutusvoitot ovat verovapaita."]

{"sheet":"Varaukset","index":11,"n_rows":40,"n_cols":13,"rows_kept":40,"cut":false,"hidden":false,"merged":[[3,1,3,7],[4,1,4,7],[10,1,10,3],[12,1,12,3],[13,1,13,3],[15,1,15,3],[12,6,12,8],[10,6,10,8],[13,6,13,8],[16,6,16,8],[15,6,15,8],[16,1,16,3]]}
[null,"Mette 2016"]
[null,{"$f":"Tulot!A2","v":"Metsätalouden kirjanpito"}]
[null,"Varaukset"]
[null,{"$f":"Etusivu!C10","v":"RAJOITETTU TESTIVESIO"}]
[null,{"$f":"Etusivu!E10","v":"Testitila 1:45"}]
[]
[null,"Valitse alue"]
[null,"Etelä-Suomi",null,null,{"$f":"CONCATENATE(\"Vuodet \",M11,\" - \",M12,\"  käytössä vain Oulun- ja Lapin läänissä, Pohjois-Suomi -valinnalla\")","v":"Vuodet 2010 - 2011  käytössä vain Oulun- ja Lapin läänissä, Pohjois-Suomi -valinnalla"}]
[]
[null,"Taulukon käyttöohje  "]
[null,"Tehty menovaraus yhteensä, ennen varausten tuloutusta",null,null,{"$f":"SUM(C23:C30)","v":15880.77},null,"Tehty tuhovaraus yhteensä, ennen varausten tuloutusta",null,null,{"$f":"SUM(H23:H30)","v":1230},null,null,{"$f":"Etusivu!$C9-6","v":2010}]
[null,null,null,null,null,null,null,null,null,null,null,null,{"$f":"Etusivu!$C9-5","v":2011}]
[null,"Menovarauksen haluttu kokonaiskäyttö verovuonna",null,null,0,null,"Tuhovarauksen haluttu kokonaiskäyttö verovuonna",null,null,0]
[null,"Mevovarauksen pakollinen tuloutus",null,null,{"$f":"IF(B8=K22,D23,D25)","v":3500},null,"Mevovarauksen pakollinen tuloutus",null,null,{"$f":"IF(B8=K22,I23,I25)","v":0}]
[]
[null,"Verovuoden tuloutettava menovaraus",null,null,{"$f":"SUM(D23:D30)","v":3500},null,"Verovuoden tuloutettava tuhovaraus",null,null,{"$f":"SUM(I23:I30)","v":0}]
[null,"Menovaraukset yhteensä tuloutuksen jälkeen",null,null,{"$f":"SUM(E23:E30)","v":12380.77},null,"Tuhovaraukset yhteensä tuloutuksen jälkeen",null,null,{"$f":"SUM(J23:J30)","v":1230}]
[]
[]
[null,"Menovaraus =  ",0.15,null,{"$f":"IF(C20>15%,\"Menovaraus voi olla enintään 15%\",\"\")","v":""},null,"Tuhovaraus  =",1,{"$f":"IF(H20>100%,\"<-- Ei voi olla suurempi, kuin 100%\",\"\")","v":""}]
[null,null,"Menovaraus",null,null,null,null,"Tuhovaraus",null,null,"Etelä-Suomi"]
[null,"Vuosi, jolloin varaus on tehty","Jäljellä vuoden alussa","Verovuoden käyttö","jää / siirtyy seuraavaan vuoteen",null,"Vuosi, jolloin varaus on tehty","Jäljellä vuoden alussa","Verovuoden käyttö","jää / siirtyy seuraavaan vuoteen","Pohjois-Suomi"]
[null,{"$f":"IF($B8=$K22,Etusivu!$C9-6,\" \")","v":" "},null,{"$f":"IF(B8=K22,C23,0)","v":0},0,{"$f":"IF($B8=$K21,IF(C23>0,\"Tarkista aluevalintasi\",\"\"),\"\")","v":""},{"$f":"IF($B$8=$K$22,Etusivu!$C$9-6,\" \")","v":" "},null,{"$f":"IF(B8=K22,H23,0)","v":0},0,{"$f":"IF($B8=$K21,IF(H23>0,\"Tarkista aluevalintasi\",\"\"),\"\")","v":""}]
[null,{"$f":"IF(B8=K22,Etusivu!C9-5,\" \")","v":" "},null,{"$f":"IF(B8=K22,C24-E24,0)","v":0},{"$f":"IF(B8=K21,0,IF(E13>=C24+C23,0,IF(C24+C23-E13>=C24,C24,C24-E13+E14)))","v":0},{"$f":"IF($B8=$K21,IF(C24>0,\"Tarkista aluevalintasi\",\"\"),\"\")","v":""},{"$f":"IF($B$8=$K$22,Etusivu!$C$9-5,\" \")","v":" "},null,{"$f":"IF(B8=K22,H24-J24,0)","v":0},{"$f":"IF(B8=K21,0,IF(J13>=H24+H23,0,IF(H24+H23-J13>=H24,H24,H24-J13+J14)))","v":0},{"$f":"IF(B8=K21,IF(H24>0,\"Tarkista aluevalintasi\",\"\"),\"\")","v":""}]
[null,{"$f":"Etusivu!C9-4","v":2012},3500,{"$f":"C25-E25","v":3500},{"$f":"IF(B8=K21,0,IF(E13>=C25+C24+C23,0,IF(C25+C24+C23-E13>=C25,C25,C25-E13)))","v":0},null,{"$f":"Etusivu!$C$9-4","v":2012},null,{"$f":"H25-J25","v":0},{"$f":"IF(B8=K21,0,IF(J13>=H25+H24+H23,0,IF(H25+H24+H23-J13>=H25,H25,H25-J13)))","v":0}]
[null,{"$f":"Etusivu!C9-3","v":2013},1200,{"$f":"C26-E26","v":0},{"$f":"IF(E13>=C26+C25+C24+C23,0,IF(C26+C25+C24+C23-E13>=C26,C26,C26+C25+C24+C23-E13))","v":1200},null,{"$f":"Etusivu!$C$9-3","v":2013},null,{"$f":"H26-J26","v":0},{"$f":"IF(J13>=H26+H25+H24+H23,0,IF(H26+H25+H24+H23-J13>=H26,H26,H26+H25+H24+H23-J13))","v":0}]
[null,{"$f":"Etusivu!C9-2","v":2014},6430,{"$f":"C27-E27","v":0},{"$f":"IF(E13>=C27+C26+C25+C24+C23,0,IF(C27+C26+C25+C24+C23-E13>=C27,C27,C27+C26+C25+C24+C23-E13))","v":6430},null,{"$f":"Etusivu!$C$9-2","v":2014},null,{"$f":"H27-J27","v":0},{"$f":"IF(J13>=H27+H26+H25+H24+H23,0,IF(H27+H26+H25+H24+H23-J13>=H27,H27,H27+H26+H25+H24+H23-J13))","v":0}]
[null,{"$f":"Etusivu!C9-1","v":2015},null,{"$f":"C28-E28","v":0},{"$f":"IF(E13>=C28+C27+C26+C25+C24+C23,0,IF(C28+C27+C26+C25+C24+C23-E13>=C28,C28,C28+C27+C26+C25+C24+C23-E13))","v":0},null,{"$f":"Etusivu!$C$9-1","v":2015},null,{"$f":"H28-J28","v":0},{"$f":"IF(J13>=H28+H27+H26+H25+H24+H23,0,IF(H28+H27+H26+H25+H24+H23-J13>=H28,H28,H28+H27+H26+H25+H24+H23-J13))","v":0}]
[null,null,"Verovuoden lisäys",null,null,null,null,"Verovuoden lisäys"]
[null,{"$f":"Etusivu!C9","v":2016},{"$f":"IF((Tulot!H8-(SUM('Hank.työ 1'!C15:G15)-SUM('Hank.työ 1'!X19:AB19)+SUM('Hank.työ 2'!C15:G15)-SUM('Hank.työ 2'!X17:AB17))-Vähennys!C37+Tulot!P7+Tulot!R7)<0,0,((Tulot!H8-(SUM('Hank.työ 1'!C15:G15)-SUM('Hank.työ 1'!X19:AB19)+SUM('Hank.työ 2'!C15:G15)-SUM('Hank.työ 2'!X17:AB17))-Vähennys!C37+Tulot!P7+Tulot!R7)*Varaukset!C20))","v":4750.7700000000004},{"$f":"C30-E30","v":0},{"$f":"IF(E13>=C30+C28+C27+C26+C25,0,IF(C30+C28+C27+C26+C25-E13>=C30,C30,C30+C28+C27+C26+C25-E13))","v":4750.7700000000004},null,{"$f":"Etusivu!$C$9","v":2016},{"$f":"(Tulot!N7+Tulot!O7)*H20","v":1230},{"$f":"H30-J30","v":0},{"$f":"IF(J13>=H30+H28+H27+H26+H25,0,IF(H30+H28+H27+H26+H25-J13>=H30,H30,H30+H28+H27+H26+H25-J13))","v":1230}]
[]
[null,"Menovaraus on enintään 15% metsätalouden tuloista",null,null,null,null,"Tuhovaraus on korkeintaan uudistuskustannusten suuruinen.  "]
[null,"Verottaja tulouttaa varaukset automaattisesti 4 v. kuluttua (Pohjois-Suomessa 6 vuoden kuluttua)"]
[]
[null,"OHJE:"]
[null,"* Sijoita aiemmilta vuosilta tulouttamatta olevat varaukset ko vuoden kohdalle sarakkeeseen \"Jäljellä verovuoden alussa\""]
[null,"* Ohjelma laskee verovuoden varauksen soluun \"Verovuoden lisäys\""]
[null,"*  Merkitse verovuodelle haluttu varausten tuloutuksen kokonaismäärä soluun \" Varausten haluttu kokonaiskäyttö verovuonna\"."]
[null,"   (Huomioi pakollinen viimeisen vuoden vähennyksen määrä.) "]
[null,"*  Ohjelma laskee kullekin vuodelle jäljelle jäävän varauksen määrän sarakkeeseen \"Jää/Siirtyy seuraavaan vuoteen\""]

{"sheet":"Vähennys","index":12,"n_rows":42,"n_cols":24,"rows_kept":42,"cut":false,"hidden":false,"merged":[[3,0,3,9],[4,0,4,9],[41,1,42,1]]}
["Mette 2016"]
["Metsätalouden kirjanpito"]
["Metsävähennyksen laskenta",null,null,null,null,null,null,null,null,null,"Ohje:"]
[{"$f":"Etusivu!C10","v":"RAJOITETTU TESTIVESIO"}]
[{"$f":"Etusivu!E10","v":"Testitila 1:45"}]
[null,null,"Ohje",null,null,"Aputaulukot: tilatietojen vapaaehtoista seuraamiseksi"]
[null,"Metsävähennystilan ns. seurantanumero","Tilat yhteensä",null,1,2,3,4,5,6,7,8,9,10,11,12,13,14,15,16,17,18]
[null,"Merkitse tila verovuonna myydyksi kirjoittamalla tilan kohdalle \"Myyty\""]
[null,"Tilan nimi                                                  (Tilanimet päivittyvät etusivulta)",null,null,{"$f":"Etusivu!E10","v":"Testitila 1:45"},{"$f":"Etusivu!E11","v":0},{"$f":"Etusivu!E12","v":0},{"$f":"Etusivu!E13","v":0},{"$f":"Etusivu!E14","v":0},{"$f":"Etusivu!E15","v":0},{"$f":"Etusivu!E16","v":0},{"$f":"Etusivu!E17","v":0},{"$f":"Etusivu!E18","v":0},{"$f":"Etusivu!G10","v":0},{"$f":"Etusivu!G11","v":0},{"$f":"Etusivu!G12","v":0},{"$f":"Etusivu!G13","v":0},{"$f":"Etusivu!G14","v":0},{"$f":"Etusivu!G15","v":0},{"$f":"Etusivu!G16","v":0},{"$f":"Etusivu!G17","v":0},{"$f":"Etusivu!G18","v":0},null,"Myyty"]
[null,"Kiinteistötunnus",null,null,"90-403-1-45"]
[null,"Tilan hankinta-ajankohta",null,null,4102001]
[null,null,"euro  snt",null,"euro  snt","euro  snt","euro  snt","euro  snt","euro  snt","euro  snt","euro  snt","euro  snt","euro  snt","euro  snt","euro  snt","euro  snt","euro  snt","euro  snt","euro  snt","euro  snt","euro  snt","euro  snt"]
[null,"Tilan hankintameno, €",{"$f":"SUM(E13:V13)","v":65300},null,65300]
[null,"Metsän osuus hankintamenosta, €",55000,null,55000]
[null,"Hankintamenon lisäykset ja vähennykset verovuoden aikana, €",0]
["18.","josta 60 % = metsävähennyspohja (verovuoden lopussa)",33000,null,{"$f":"IF(E8=\"myyty\",0,(E14+E15)*0.6)","v":33000},{"$f":"IF(F8=\"myyty\",0,(F14+F15)*0.6)","v":0},{"$f":"IF(G8=\"myyty\",0,(G14+G15)*0.6)","v":0},{"$f":"IF(H8=\"myyty\",0,(H14+H15)*0.6)","v":0},0,0,0,0,0,0,0,0,0,0,0,0,0,0]
["19.",{"$f":"CONCATENATE(\"Ennen verovuotta \",Etusivu!C9,\" käytetty metsävähennys\")","v":"Ennen verovuotta 2016 käytetty metsävähennys"},4500,null,4500]
[null,{"$f":"CONCATENATE(\"Ennen verovuotta  \",Etusivu!C9,\" luovutusvoittoihin lisätty metsävähennys\")","v":"Ennen verovuotta  2016 luovutusvoittoihin lisätty metsävähennys"},0]
[null,"Käytettävissä oleva metsävähennys tiloilta yhteensä",{"$f":"IF(SUM(E19:V19)<=0,0,SUM(E19:V19))","v":28500},null,{"$f":"IF(E8=\"Myyty\",0,IF(E16-E17+E18>E16,E16,E16-E17+E18))","v":28500},{"$f":"IF(F8=\"Myyty\",0,IF(F16-F17+F18>F16,F16,F16-F17+F18))","v":0},{"$f":"IF(G8=\"Myyty\",0,IF(G16-G17+G18>G16,G16,G16-G17+G18))","v":0},{"$f":"IF(H8=\"Myyty\",0,IF(H16-H17+H18>H16,H16,H16-H17+H18))","v":0},0,0,0,0,0,0,0,0,0,0,0,0,0,0]
[]
[null,"Metsätalouden metsävähennyskelpoinen pääomatulo verovuonna yhteensä",{"$f":"SUMIF(Tulot!$J$9:$J$164,E7,Tulot!$F9:$F164)+SUMIF(Tulot!$J$9:$J$164,E7,Tulot!$N$9:$N$164)+SUMIF(Tulot!$J$9:$J$164,E7,Tulot!$O$9:$O$164)+SUMIF(Tulot!$J$9:$J$164,E7,Tulot!$P$9:$P$164)+SUMIF(Tulot!$J$9:$J$164,E7,Tulot!$R$9:$R$164)+Tulot!H171+Tulot!I171+Tulot!J171+'Hank.työ 1'!Q48+'Hank.työ 1'!Q83+'Hank.työ 1'!Q118+'Hank.työ 1'!Q153+'Hank.työ 1'!Q188+'Hank.työ 2'!Q39+'Hank.työ 2'!Q66+'Hank.työ 2'!Q93+'Hank.työ 2'!Q120+'Hank.työ 2'!Q147","v":60046.79}]
[{"$f":"CONCATENATE(\"Vuodelle \",Etusivu!C9,\" käytettävissä oleva metsävähennys\")","v":"Vuodelle 2016 käytettävissä oleva metsävähennys"}]
[null,"Metsävähennyksen enimmäismäärä tiloilta yhteensä",{"$f":"IF(C36*0.6<1500,0,IF(C36*0.6<=C35,C36*0.6,C35))","v":28500},null,{"$f":"IF(C23<1500,\"OHJETEKSTI: Ei metsävähennysoikeutta. Metsävähennyksen tulee olla vähintään 1500 €\", \"\")","v":""}]
[null,"Tiloille kohdistettu metsävähennys yhteensä",{"$f":"SUM(E25:V25)","v":0},null,{"$f":"IF(C23>C24,CONCATENATE(\"Metsävähennyksestä kohdentamatta \",C23-C24,\"€\"),IF(C24>C23,\"Metsävähennystä kohdennettu liikaa. Ks rivi 23\",\"Kaikki metsävähennys kohdennettu tiloille\"))","v":"Metsävähennyksestä kohdentamatta 28500€"}]
[" ==>","Metsävähennyksen kohdistaminen tiloittain",{"$f":"IF($C23=0,0,IF(C21*0.6<=C19,C21*0.6-SUM(E25:V25),C19))","v":28500},null,null,null,0,0,0,0,0,0,0,0,0,0,0,0,0,0,0,0]
[null,"Jäljelle jäävä metsävähennys vuoden lopussa",{"$f":"C19-C25","v":0},null,{"$f":"E19-E25","v":28500},0,0,0,0,0,0,0,0,0,0,0,0,0,0,0,0,0]
[]
[null,"Korjaa, jos et halua käyttää metsävähennyksen enimmäismäärää. ",{"$f":"C23","v":28500},null,{"$f":"IF(E26<0,\"korjaa\",\"\")","v":""},"","","","","","","","","","","","","","","","",""]
[null,null,{"$f":"IF(C28>C23,\"Virhe - Solussa C27 oleva luku ei saa olla suurempi kuin solussa C23\",\"\")","v":""},null,{"$f":"IF(E26<0,\"Ei sallittu\",\"\")","v":""},{"$f":"IF(F26<0,\"Ei sallittu\",\"\")","v":""},{"$f":"IF(G26<0,\"Ei sallittu\",\"\")","v":""},"","","","","","","","","","",{"$f":"IF(R26<0,\"Ei sallittu\",\"\")","v":""},{"$f":"IF(S26<0,\"Ei sallittu\",\"\")","v":""},{"$f":"IF(T26<0,\"Ei sallittu\",\"\")","v":""},{"$f":"IF(U26<0,\"Ei sallittu\",\"\")","v":""},{"$f":"IF(V26<0,\"Ei sallittu\",\"\")","v":""}]
[]
[]
["18.","Metsävähennyspohja yhteensä (verovuoden lopussa)",{"$f":"C16","v":33000}]
["19.",{"$f":"CONCATENATE(\"Ennen vuotta \",Etusivu!C9,\" käytetty metsävähennys yhteensä\")","v":"Ennen vuotta 2016 käytetty metsävähennys yhteensä"},{"$f":"C17","v":4500}]
["20.","Luovutusvoittoihin lisätty metsävähennys (vuodesta 2009 alkaen)",{"$f":"Luovutusv.!G16+C18","v":0}]
["21.","Käyttämättä oleva metsävähennys yhteensä   (18.-(19.-20.))",{"$f":"IF(C32-(C33-C34)<1500,0,C32-(C33-C34))","v":28500}]
["22.","Metsätalouden veronalainen pääomatulo metsävähennystiloilta yht.",{"$f":"C21","v":60046.79},null,{"$f":"IF(C36>=1500,\"\",\"  OHJETEKSTI: Tulon määrä on oltava vähintään 2500, jotta metsävähennyksen alaraja 1500 Euroa täyttyy.\")","v":""}]
["23.","Verovuoden metsävähennys",{"$f":"IF(C23<1500,0,IF(C23<=C35,C28,C35))","v":28500},null,null,{"$f":"IF(C37>C23,\"OHJETEKSTI: Metsävähennystä jettu liikaa. Ks rivi 23\",\"\")","v":""}]
["24.","Käytetty metsävähennys yhteensä verovuoden lopussa    (19.+23.)",{"$f":"C33+C37","v":33000}]
[null,"Käyttämättä oleva metsävähennys vuoden lopussa yhteensä",{"$f":"C35-C37","v":0},null,{"$f":"IF(C37>=1500,\"\",\" OHJETEKSTI: Jos metsävähennystä jäljellä alle 1500, ohjelma antaa arvon 0,00. Metsävähennys tulee olla vähintään 1500 euroa vuodessa. \")","v":""}]
[]
[]
[null,{"$f":"IF(C39>=1500,\"Metsävähennystä jää käytettäväksi tulevina vuosina\",\"Vinkki: Metsävähennystä jäljellä alle 1500, mahdollista loppuosaa ei voi käyttää ilman uuden metsätilan hankintaa.\")","v":"Vinkki: Metsävähennystä jäljellä alle 1500, mahdollista loppuosaa ei voi käyttää ilman uuden metsätilan hankintaa."}]

{"sheet":"2C","index":13,"n_rows":118,"n_cols":60,"rows_kept":118,"cut":false,"hidden":false,"merged":[[114,1,114,20],[86,16,86,20],[77,46,77,47],[77,42,78,45],[75,40,76,41],[74,44,74,45],[73,40,74,41],[75,46,75,47],[78,46,78,48],[75,18,75,19],[74,42,74,43],[77,1,78,5],[73,14,73,17],[74,46,74,47],[114,29,114,48],[73,42,73,45],[92,37,92,44],[79,42,80,45],[81,34,82,36],[100,34,100,36],[90,45,90,48],[73,37,74,39],[75,29,76,33],[75,34,76,36],[117,1,117,20],[112,1,112,4],[107,1,107,5],[107,8,107,14],[107,15,107,20],[79,6,80,8],[98,6,98,8],[95,1,95,3],[95,4,95,5],[98,1,98,3],[90,17,90,20],[79,1,80,5],[100,1,100,3],[100,4,100,5],[98,4,98,5],[100,9,100,13],[100,14,100,18],[98,9,98,13],[90,1,90,4],[95,19,95,20],[89,17,89,20],[92,9,92,16],[81,9,82,11],[83,18,83,19],[73,6,74,8],[75,14,76,17],[75,1,76,5],[62,6,62,11],[61,6,61,11],[62,2,62,5],[58,18,58,19],[73,12,74,13],[66,2,66,17],[73,1,74,5],[75,9,76,11],[75,12,76,13],[65,18,65,19],[62,12,62,17],[22,0,23,1],[20,2,20,5],[20,6,20,11],[20,12,20,17],[22,2,22,5],[53,5,53,7],[57,5,57,7],[64,19,64,21],[63,18,63,19],[55,5,55,7],[55,19,55,21],[25,0,38,1],[45,19,45,21],[45,12,45,17],[45,6,45,11],[53,13,53,17],[61,2,61,5],[57,13,57,17],[47,13,47,17],[59,19,59,21],[45,2,45,5],[57,2,57,4],[47,8,47,12],[55,8,55,12],[10,2,10,11],[15,17,15,19],[12,13,12,21],[19,18,19,19],[10,14,10,21],[18,18,18,20],[13,20,13,21],[13,13,13,19],[9,13,9,20],[12,1,13,8],[11,2,11,11],[0,2,0,12],[5,17,5,21],[15,13,15,16],[4,2,4,11],[5,2,5,11],[43,2,43,5],[43,6,43,11],[44,2,44,3],[2,1,3,51],[6,2,6,11],[7,2,7,11],[37,12,37,17],[19,0,21,1],[32,2,32,5],[28,2,28,5],[28,6,28,11],[35,2,35,5],[30,6,30,11],[23,19,25,21],[30,2,30,5],[39,2,39,5],[39,6,39,11],[37,2,37,5],[9,2,9,11],[28,12,28,17],[51,13,51,17],[49,13,49,17],[41,12,41,17],[26,12,26,17],[33,12,33,17],[35,12,35,17],[26,6,26,11],[49,8,49,12],[49,5,49,7],[51,5,51,7],[76,46,76,48],[73,46,73,48],[75,42,76,45],[112,29,112,32],[103,42,103,48],[107,29,107,33],[107,36,107,42],[102,29,103,41],[107,43,107,48],[101,29,101,48],[95,34,95,36],[95,29,95,31],[100,47,100,48],[98,47,98,48],[95,47,95,48],[100,37,100,41],[81,42,82,45],[81,46,81,47],[79,46,79,47],[80,46,80,48],[95,42,95,46],[100,42,100,46],[98,37,98,41],[79,40,80,41],[81,40,82,41],[79,29,80,33],[30,19,30,21],[41,19,41,21],[61,19,62,21],[55,13,55,17],[60,18,60,19],[39,12,39,17],[30,12,30,17],[61,12,61,17],[53,8,53,12],[33,6,33,11],[37,19,37,21],[47,5,47,6],[57,8,57,12],[32,12,32,17],[33,3,33,5],[43,12,43,17],[54,13,54,14],[56,13,56,14],[77,29,78,33],[31,18,31,19],[33,19,33,21],[77,40,78,41],[91,33,92,36],[90,34,90,36],[90,37,90,44],[89,45,89,48],[89,37,89,44],[98,34,98,36],[95,32,95,33],[95,37,95,41],[97,37,97,41],[90,29,90,32],[77,9,78,11],[77,12,78,13],[77,34,78,36],[81,37,82,39],[100,6,100,8],[95,9,95,13],[97,9,97,13],[89,34,89,36],[95,14,95,18],[95,6,95,8],[83,14,83,17],[80,18,80,20],[98,14,98,18],[79,18,79,19],[79,14,80,17],[87,9,88,16],[87,37,88,44],[88,34,88,36],[86,44,86,48],[83,46,83,47],[82,46,82,48],[83,42,83,45],[88,45,88,48],[98,42,98,46],[75,37,76,39],[74,18,74,19],[73,29,74,33],[73,34,74,36],[77,14,78,17],[76,18,76,20],[66,19,66,21],[79,34,80,36],[81,14,82,17],[81,18,81,19],[82,18,82,20],[74,16,74,17],[71,13,71,15],[71,16,71,20],[74,14,74,15],[73,18,73,20],[81,12,82,13],[79,37,80,39],[111,1,111,4],[117,29,117,48],[111,29,111,32],[71,41,71,43],[71,44,71,48],[102,1,103,13],[103,14,103,20],[81,29,82,33],[91,1,92,4],[91,5,92,8],[90,6,90,8],[88,6,88,8],[88,17,88,20],[79,12,80,13],[81,1,82,5],[81,6,82,8],[100,19,100,20],[90,9,90,16],[89,9,89,16],[101,1,101,20],[89,6,89,8],[98,19,98,20],[77,37,78,39],[78,18,78,20],[22,19,22,21],[26,19,26,21],[24,6,24,11],[24,12,24,17],[22,6,22,11],[22,12,22,17],[25,6,25,11],[25,12,25,17],[100,29,100,31],[98,29,98,31],[91,29,92,32],[100,32,100,33],[98,32,98,33],[59,23,60,23],[77,18,77,19],[77,6,78,8],[79,9,80,11],[41,6,41,11],[32,6,32,11],[35,6,35,11],[37,6,37,11],[51,8,51,12],[73,9,74,11],[75,6,76,8]]}
[]
[null,"Ohjelman lisenssi oikeuttaa ohjelman käyttöön vain maksetun verovuoden osalta. Osta uusi metsavero.fi sivustolta."]
[null,{"$f":"IF(Etusivu!B7>2016,\"Yrität käyttää Mette kirjanpito-ohjelmaa vastoin käyttöehtoja. Osta uusi ohjelma osoitteesta www.metsavero.fi\",IF(Etusivu!B7<2016,\"Yrität käyttää Mette kirjanpito-ohjelmaa vastoin käyttöehtoja. Osta uusi ohjelma osoitteesta www.metsavero.fi\",\"\"))","v":""}]
[]
[null,null,"VEROHALLINTO",null,null,null,null,null,null,null,null,null,null,null,null,null,null,"Viimeinen palautuspäivä"]
[null,null,"TUNNUS 5019832",null,null,null,null,null,null,null,null,null,null,null,null,null,null,{"$f":"Etusivu!C27","v":"28022017"}]
[null,null,"00003 VASTAUSLÄHETYS",null,null,null,null,null,null,null,null,null,null,null,null,null,null,"METSÄTALOUDEN "]
[null,null,null,null,null,null,null,null,null,null,null,null,null,null,null,null,null,"VEROILMOITUS"]
[null,null,"Verovelvollisen nimi ja osoite",null,null,null,null,null,null,null,null,null,null,null,null,null,null,"Kaikki maatilat yhteensä"]
[null,null,{"$f":"Etusivu!C10","v":"RAJOITETTU TESTIVESIO"},null,null,null,null,null,null,null,null,null,null,{"$f":"CONCATENATE(\"Kotikunta 31.12.\",Etusivu!C9-1)","v":"Kotikunta 31.12.2015"}]
[null,null,{"$f":"Etusivu!C11","v":"Osoite"},null,null,null,null,null,null,null,null,null,null,null,{"$f":"Etusivu!C22","v":"Kunta"}]
[null,null,{"$f":"CONCATENATE(Etusivu!C12,\" \",Etusivu!C13)","v":"38210 Sastamala"},null,null,null,null,null,null,null,null,null,null,"Henkilötunnus tai Y-tunnus"]
[null,null,null,null,null,null,null,null,null,null,null,null,null,{"$f":"Etusivu!C14","v":"1322222-2"}]
[null,null,null,null,null,null,null,null,null,null,null,null,null,"Puolisoiden osuudet metsäomaisuudesta %",null,null,null,null,null,null,"  600 Oma erillinen"]
[null,null,null,null,null,null,null,null,null,null,null,null,null,"601  Verovelvollinen",null,null,null,"602 Puoliso",null,null,"  ilmoitus"]
[null,null,null,null,null,null,null,null,null,null,null,null,null,{"$f":"IF(Etusivu!C23=\"kyllä\",\"\",Etusivu!C24)","v":1},null,null,null,{"$f":"IF(Etusivu!C23=\"kyllä\",\"\",Etusivu!C25)","v":0}]
[]
[]
[null,null,"I  Laskelma metsätalouden pääomatulosta",null,null,null,null,null,null,null,null,null,null,null,null,null,null,null,"euro",null,null,"snt"]
["2 C",null,"1. Puun myyntitulot"]
[null,null,"1.1.Pystykaupat",null,null,null,"1.2. Hankintakaupat",null,null,null,null,null,"1.3. Poltto- ja joulukuusikaupat"]
[null,null,603,null,null,null,604,null,null,null,null,null,613]
[2016,null,{"$f":"Tulot!F7","v":56600},null,null,null,{"$f":"Tulot!G7","v":3450},null,null,null,null,null,{"$f":"Tulot!H7","v":0},null,null,null,null,null,"+",{"$f":"C23+G23+M23","v":60050}]
[null,null,"2. Hankintatyön arvo"]
[null,null,null,null,null,null,"2.1. Hankintakaupat",null,null,null,null,null,"2.2. Poltto- ja joulukuusikaupat",null,null,null,null,null,null,null,null,null,null,{"$f":"IF(G27>G23,\"Hankintatyön arvo ei saa olla hankintakauppatuloa suurempi. Tarkista hankintakaupan summat!\",0)","v":0}]
[null,null,null,null,null,null,605,null,null,null,null,null,625]
[null,null,null,null,null,null,{"$f":"SUM('Hank.työ 1'!C15:G15)+'Hank.työ 1'!W4","v":318.20999999999998},null,null,null,null,null,{"$f":"SUM('Hank.työ 2'!C15:G15)+'Hank.työ 2'!W4","v":0},null,null,null,null,null," - ",{"$f":"C27+G27+M27","v":318.20999999999998},null,null,null,{"$f":"IF(M27>M23,\"Hankintatyön arvo ei saa olla hankintakauppatuloa suurempi. Tarkista Poltto- ja joulupuiden summat!\",0)","v":0}]
[null,null,"3. Vakuutus- ja hirvivahinkokorvaukset, metsätalouden tuet"]
[null,null,"3.1. Vakuutuskorvaukset",null,null,null,"3.2. Hirvivahinkokorvaukset",null,null,null,null,null,"3.3. Metsätalouden tuet"]
[null,null,607,null,null,null,608,null,null,null,null,null,609]
[null,null,{"$f":"Tulot!N7","v":1230},null,null,null,{"$f":"Tulot!O7","v":0},null,null,null,null,null,{"$f":"Tulot!P7","v":440},null,null,null,null,null,"+",{"$f":"M31+G31+C31","v":1670}]
[null,null,"4. Omasta metsästä otettu puutavara",null,null,null,null,null,null,null,null,null,null,null,null,null,null,null,614]
[null,null,"4.1. Maatalouskäyttö",null,null,null,"4.2. Elinkeinokäyttö",null,null,null,null,null,"4.3. Yksityiskäyttö"]
[null,null,null,{"$f":"Tulot!E171+Tulot!H171","v":0},null,null,{"$f":"Tulot!F171+Tulot!I171","v":0},null,null,null,null,null,{"$f":"Tulot!G171+Tulot!J171","v":315},null,null,null,null,null,"+",{"$f":"M34+G34+D34","v":315}]
[null,null,"5. Metsävähennys ja varaukset"]
[null,null,"5.1. Metsävähennys",null,null,null,"5.2. Menovaraus",null,null,null,null,null,"5.3. Tuhovaraus"]
[null,null,615,null,null,null,616,null,null,null,null,null,617]
[null,null,{"$f":"Vähennys!C37","v":28500},null,null,null,{"$f":"Varaukset!C30","v":4750.7700000000004},null,null,null,null,null,{"$f":"Varaukset!H30","v":1230},null,null,null,null,null," -",{"$f":"M38+G38+C38","v":34480.769999999997}]
[null,null,"6. Muut pääomatuloksi luettavat erät"]
[null,null,null,null,null,null,"6.1. Varausten tuloutus",null,null,null,null,null,"6.2. Muut"]
[null,null,null,null,null,null,619,null,null,null,null,null,620]
[null,null,null,null,null,null,{"$f":"Varaukset!E16+Varaukset!J16","v":3500},null,null,null,null,null,{"$f":"Tulot!R7","v":0},null,null,null,null,null,"+",{"$f":"C42+M42+G42","v":3500}]
[null,null,"7. Vuosimenot"]
[null,null,"7.1. Palkkausmenot",null,null,null,"7.2. Matkakulut",null,null,null,null,null,"7.3. Muut vuosimenot"]
[null,null,622,null,null,null,623,null,null,null,null,null,624]
[null,null,{"$f":"Menot!K7","v":0},null,null,null,{"$f":"Menot!L7","v":31.44},null,null,null,null,null,{"$f":"Menot!M7","v":575.67999999999995},null,null,null,null,null," -",{"$f":"M46+G46+C46","v":607.12}]
[null,null,"Selvitys poistoina vähennettävistä menoista"]
[null,null,null,null,null,"Koneet ja kalusto",null,null,"Rakennukset",null,null,null,null,"Ojat ja tiet"]
[]
[null,null,{"$f":"CONCATENATE(\"8. Menojäännös 1.1.\",Etusivu!C9)","v":"8. Menojäännös 1.1.2016"},null,null,{"$f":"Poistot!D8","v":2500},null,null,{"$f":"Poistot!D30","v":0},null,null,null,null,{"$f":"Poistot!D37","v":0}]
[]
[null,null,"9. Lisäykset verovuonna",null,null,{"$f":"Poistot!E8","v":629.03},null,null,{"$f":"Poistot!E30","v":0},null,null,null,null,{"$f":"Poistot!E37","v":1935.48}]
[null,null,null,null,null,645,null,null,646]
[null,null,"10. Luovutukset verovuonna",null,null,{"$f":"Poistot!F8","v":0},null,null,{"$f":"Poistot!F30","v":0},null,null,null,null,{"$f":"Poistot!F37","v":0}]
[null,null,null,null,null,642,null,null,643,null,null,null,null,644]
[null,null,"11. Poistot",null,null,{"$f":"Poistot!H8","v":782.26},null,null,{"$f":"Poistot!H30","v":0},null,null,null,null,{"$f":"Poistot!H37","v":290.32},null,null,null,null," -",{"$f":"SUM(F56:R56)","v":1072.58}]
[null,null,null,null,null,626,null,null,627,null,null,null,null,628]
[null,null,{"$f":"CONCATENATE(\"12. Menojäännös 31.12.\",Etusivu!C9)","v":"12. Menojäännös 31.12.2016"},null,null,{"$f":"Poistot!I8","v":2346.77},null,null,{"$f":"Poistot!I30","v":0},null,null,null,null,{"$f":"Poistot!I37","v":1645.16}]
[null,null,"13. Toisesta tulonlähteestä siirrettävät menot",null,null,null,null,null,null,null,null,null,null,null,null,null,null,null,630]
[null,null,null,null,null,null,null,null,null,null,null,null,null,null,null,null,null,null,"-",0,null,null,null,"OHJE:"]
[null,null,"14. Metsätalouden muistiinpanoihin sisältyneet muun toiminnan menot",null,null,null,null,null,null,null,null,null,null,null,null,null,null,null,634]
[null,null,"14.1. Maatalouden menot",null,null,null,"14.2. Elinkeinotoiminnan menot",null,null,null,null,null,"14.3. Yksityismenot",null,null,null,null,null,null,{"$f":"SUM(C63:R63)","v":0}]
[null,null,{"$f":"Menot!X7+Poistot!K8+Poistot!K30+Poistot!K37","v":0},null,null,null,{"$f":"Menot!Y7+Poistot!L8+Poistot!L30+Poistot!L37","v":0},null,null,null,null,null,{"$f":"Menot!Z7+Poistot!M8+Poistot!M30+Poistot!M37","v":0},null,null,null,null,null," +"]
[null,null,null,null,null,null,null,null,null,null,null,null,null,null,null,null,null,null,635]
[null,null,"15. Metsätalouden puhdas pääomatulo",null,null,null,null,null,null,null,null,null,null,null,null,null,null,null," =",{"$f":"IF(T23-T27+T31+T34-T38+T42-T46-T56-T60+T62>=0,T23-T27+T31+T34-T38+T42-T46-T56-T60+T62,\"\")","v":29056.32}]
[null,null," tai",null,null,null,null,null,null,null,null,null,null,null,null,null,null,null,"636"]
[null,null,"16. Metsätalouden tappiollinen pääomatulo",null,null,null,null,null,null,null,null,null,null,null,null,null,null,null," =",{"$f":"IF(T23-T27+T31+T34-T38+T42-T46-T56-T60+T62<0,T23-T27+T31+T34-T38+T42-T46-T56-T60+T62,\"\")","v":""},null,null,null,null,null,null,null,null,null,"Lomake 2. Hankintatyöntekijät 5-8  (jaa itse hankintatyöntekijöiden työmäärän suhteessa)"]
[]
[]
[]
[]
[null,null,null,null,null,null,null,null,null,null,null,null,null,"Y-tunnus tai\nhenkilötunnus",null,null,{"$f":"Etusivu!C14","v":"1322222-2"},null,null,null,null,null,null,null,null,null,null,null,null,null,null,null,null,null,null,null,null,null,null,null,null,"Y-tunnus tai\nhenkilötunnus",null,null,{"$f":"Q72","v":"1322222-2"}]
[null,{"$f":"CONCATENATE(\"II  Selvitys vuonna \",Etusivu!C9,\" tehdystä hankintatyöstä\")","v":"II  Selvitys vuonna 2016 tehdystä hankintatyöstä"},null,null,null,null,null,null,null,null,null,null,null,null,null,null,null,null,null,null,null,null,null,null,null,null,null,null,null,{"$f":"CONCATENATE(\"II  Selvitys vuonna \",Etusivu!C9,\" tehdystä hankintatyöstä\")","v":"II  Selvitys vuonna 2016 tehdystä hankintatyöstä"}]
[null,"Hankintatyön tekijän nimi",null,null,null,null,"Henkilötunnus",null,null,"Valmistettu\nmäärä\nm3",null,null,"Kuljetettu\nmäärä\nm3",null,"Hankintatyön arvo",null,null,null,"Hankintatyön\nveronalainen arvo 1)",null,null,null,null,null,null,null,null,null,null,"Hankintatyön tekijän nimi",null,null,null,null,"Henkilötunnus",null,null,"Valmistettu\nmäärä\nm3",null,null,"Kuljetettu\nmäärä\nm3",null,"Hankintatyön arvo",null,null,null,"Hankintatyön\nveronalainen arvo 1)"]
[null,null,null,null,null,null,null,null,null,null,null,null,null,null,"euro",null,"snt",null,"euro",null,"snt",null,null,null,null,null,null,null,null,null,null,null,null,null,null,null,null,null,null,null,null,null,"euro",null,"snt",null,"euro",null,"snt"]
[null,"Matti testimetsänomistaja",null,null,null,null,"060660-0606",null,null,{"$f":"SUM('Hank.työ 1'!C9:G9)+SUM('Hank.työ 2'!C9:G9)","v":21},null,null,{"$f":"SUM('Hank.työ 1'!C12:G12)+SUM('Hank.työ 2'!C12:G12)","v":21},null,{"$f":"SUM('Hank.työ 1'!C15:G15)+SUM('Hank.työ 2'!C15:G15)","v":318.20999999999998},null,null,null,15,null,null,null,null,null,null,null,null,null,null,null,null,null,null,null,null,null,null,null,null,null,null,null,null,null,null,null,15]
[null,null,null,null,null,null,null,null,null,null,null,null,null,null,null,null,null,null,{"$f":"SUM('Hank.työ 1'!C16:G16)+SUM('Hank.työ 2'!C16:G16)","v":0}]
[null,null,null,null,null,null,null,null,null,null,null,null,null,null,0,null,null,null,15,null,null,null,null,null,null,null,null,null,null,null,null,null,null,null,null,null,null,null,null,null,null,null,null,null,null,null,15]
[]
[null,null,null,null,null,null,null,null,null,null,null,null,null,null,null,null,null,null,15,null,null,null,null,null,null,null,null,null,null,null,null,null,null,null,null,null,null,null,null,null,null,null,null,null,null,null,15]
[]
[null,null,null,null,null,null,null,null,null,null,null,null,null,null,null,null,null,null,15,null,null,null,null,null,null,null,null,null,null,null,null,null,null,null,null,null,null,null,null,null,null,null,null,null,null,null,15]
[]
[null,"17. Hankintatyön arvot yhteensä",null,null,null,null,null,null,null,null,null,null,null,null,{"$f":"SUM(O76:R83)","v":318.20999999999998},null,null,null," -----",null," ---",null,null,null,null,null,null,null,null,"17. Hankintatyön arvot yhteensä",null,null,null,null,null,null,null,null,null,null,null,null,{"$f":"SUM(AQ76:AT83)","v":0},null,null,null," -----",null," ---"]
[]
[null,"III  Metsävähennyksen seuranta   (vuonna 1993 ja sen jälkeen vastikkeellisesti hankitut metsät)",null,null,null,null,null,null,null,null,null,null,null,null,null,null,null,null,null,null,null,null,null,null,null,null,null,null,null,"III  Metsävähennyksen seuranta   (vuonna 1993 ja sen jälkeen vastikkeellisesti hankitut metsät)",null,null,null,null,null,null,null,null,null,null,null,null,null,null,null,null,null,null,null,null,null,null,null,null,null,null,null,null,null,"EI TULOSTU"]
[null,"Kaikki metsävähennyskiinteistöt yhteensä",null,null,null,null,null,null,null,null,null,null,null,null,null,null,null,null,null,null,null,null,null,null,null,null,null,null,null,"Kaikki metsävähennyskiinteistöt yhteensä"]
[null,null,null,null,null,null,"euro",null,"snt","22. Metsätalouden veronalainen pääoma-\n     tulo metsävähennykseen oikeuttavista \n     metsistä verovuonna",null,null,null,null,null,null,null,null,null,"euro","snt",null,null,null,null,null,null,null,null,null,null,null,null,null,"euro",null,"snt","22. Metsätalouden veronalainen pääoma-\n     tulo metsävähennyskiinteistöiltä \n     verovuonna",null,null,null,null,null,null,null,null,null,"euro","snt"]
[null,"18. Metsävähennyspohja.    2)",null,null,null,655,{"$f":"Vähennys!C32","v":33000},null,null,null,null,null,null,null,null,null,null,{"$f":"Vähennys!C36","v":60046.79},null,null,null,null,null,null,null,null,null,null,null,"18. Metsävähennyspohja.    2)",null,null,null,655]
[null,"19. Aikaisemmin käytetty metsävähennys",null,null,null,656,{"$f":"Vähennys!C33","v":4500},null,null,"23. Verovuoden metsävähennys     3)",null,null,null,null,null,null,null,{"$f":"Vähennys!C37","v":28500},null,null,null,null,null,null,null,null,null,null,null,"19. Aikaisemmin käytetty metsävähennys",null,null,null,656,null,null,null,"23. Verovuoden metsävähennys     3)"]
[null,"20. Luovutusvoittoihin lisättyjen metsä-\n      vähennysten määrä",null,null,null,657,{"$f":"Vähennys!C34","v":0},null,null,"24. Käytetty metsävähennys yhteensä\n      = 19. + 23.",null,null,null,null,null,null,null,{"$f":"Vähennys!C38","v":33000},null,null,null,null,null,null,null,null,null,null,null,"20. Luovutusvoittoihin lisättyjen metsä-\n      vähennysten määrä",null,null,null,657,null,null,null,"24. Käytetty metsävähennys yhteensä\n      = 19. + 23."]
[null,"21. Käytettävissä olevan metsävähen-\n      nyksen määrä = 18. - (19. - 20.)",null,null,null,{"$f":"Vähennys!C35","v":28500},null,null,null,null,null,null,null,null,null,null,null,null,null,null,null,null,null,null,null,null,null,null,null,"21. Käytettävissä olevan metsävähen-\n      nyksen määrä = 18. - (19. - 20.)"]
[]
[null,"IV Tulouttamattomat varaukset",null,null,null,null,null,null,null,null,null,null,null,null,null,null,null,null,null,null,null,null,null,null,null,null,null,null,null,"IV Tulouttamattomat varaukset"]
[null,"Vuosina 2011 - 2016 tehtyjen varausten jäljellä oleva määrä vuoden 2016 lopussa",null,null,null,null,null,null,null,null,null,null,null,null,null,null,null,null,null,null,null,null,null,null,null,null,null,null,null,"Vuosina 2011 - 2016 tehtyjen varausten jäljellä oleva määrä vuoden 2016 lopussa"]
[null,"2011\n(Ent. Oulun ja Lapin läänit)",null,null,"2012\n(Ent. Oulun ja Lapin läänit)",null,2013,null,null,{"$f":"G96+1","v":2014},null,null,null,null,{"$f":"J96+1","v":2015},null,null,null,null,{"$f":"O96+1","v":2016},null,null,null,null,null,null,null,null,null,"2011\n(Oulun ja Lapin läänit)",null,null,"2012\n(Oulun ja Lapin läänit)",null,2013,null,null,{"$f":"AI96+1","v":2014},null,null,null,null,{"$f":"AL96+1","v":2015},null,null,null,null,{"$f":"AQ96+1","v":2016}]
[null,"25. Menovaraus",null,null,null,null,null,null,null,null,null,null,null,null,null,null,null,null,null,null,null,null,null,null,null,null,null,null,null,"21. Menovaraus"]
[null,637,null,null,638,null,639,null,null,640,null,null,null,null,641,null,null,null,null,null,null,null,null,null,null,null,null,null,null,637,null,null,638,null,639,null,null,640,null,null,null,null,641]
[null,{"$f":"Varaukset!E24","v":0},null,null,{"$f":"Varaukset!E25","v":0},null,{"$f":"Varaukset!E26","v":1200},null,null,{"$f":"Varaukset!E27","v":6430},null,null,null,null,{"$f":"Varaukset!E28","v":0},null,null,null,null,{"$f":"Varaukset!E30","v":4750.7700000000004}]
[null,"26. Tuhovaraus",null,null,null,null,null,null,null,null,null,null,null,null,null,null,null,null,null,null,null,null,null,null,null,null,null,null,null,"22. Tuhovaraus"]
[null,{"$f":"Varaukset!J24","v":0},null,null,{"$f":"Varaukset!J25","v":0},null,{"$f":"Varaukset!J26","v":0},null,null,{"$f":"Varaukset!J27","v":0},null,null,null,null,{"$f":"Varaukset!J28","v":0},null,null,null,null,{"$f":"Varaukset!J30","v":1230}]
[]
[]
[]
[]
[null," Veroilmoitusta täydentäviä tietoja antaa",null,null,null,null,null,null,null,null,null,null,null,null,null,"Puhelin",null,null,null,null,null,null,null,null,null,null,null,null,null," Veroilmoitusta täydentäviä tietoja antaa",null,null,null,null,null,null,null,null,null,null,null,null,null,"Puhelin"]
[null,{"$f":"IF(Etusivu!C29=\"\",\"\",Etusivu!C29)","v":"Nimi"},null,null,null,null,null,null,null,null,null,null,null,null,null,{"$f":"IF(Etusivu!C31=0,\"\",Etusivu!C31)","v":"Puhelinnumero"}]
[null,{"$f":"IF(Etusivu!C30=\"\",\"\",Etusivu!C30)","v":"Sähköpostiosoite"}]
[]
[null,"Päiväys",null,null,null,"Allekirjoitus ja nimen selvennys",null,null,null,null,null,null,null,null,null,null,null,null,null,null,null,null,null,null,null,null,null,null,null,"Päiväys",null,null,null,"Allekirjoitus ja nimen selvennys"]
[]
[null,{"$f":"Etusivu!$C27","v":"28022017"},null,null,null,null,null,null,null,null,null,null,null,null,null,null,null,null,null,null,null,null,null,null,null,null,null,null,null,{"$f":"Etusivu!$C27","v":"28022017"}]
[null,null,null,null,null,null,null,null,null,null,null,null,null,null,{"$f":"IF(Etusivu!C32=\"\",\"\",Etusivu!C32)","v":"Allekirjoittaja"},null,null,null,null,null,null,null,null,null,null,null,null,null,null,null,null,null,null,null,null,null,null,null,null,null,null,null,{"$f":"IF(Etusivu!C32=\"\",\"\",Etusivu!C32)","v":"Allekirjoittaja"}]
[]
[null,"Huom! Metsätalouden veroilmoitusta ei tarvitse antaa, jos teillä ei verovuonna 2016 ollut lainkaan metsätalouden harjoittamiseen liittyviä tuloja, vähennettäviä menoja tai metsävähennyksessä ja varauksissa ilmoitettavia seurantatietoja.",null,null,null,null,null,null,null,null,null,null,null,null,null,null,null,null,null,null,null,null,null,null,null,null,null,null,null,"Huom! Metsätalouden veroilmoitusta ei tarvitse antaa, jos teillä ei verovuonna 2016 ollut lainkaan metsätalouden harjoittamiseen liittyviä tuloja, vähennettäviä menoja tai metsävähennyksessä ja varauksissa ilmoitettavia seurantatietoja."]
[null,"1) Laskentakaava täyttöohjeessa",null,null,null,null,null,null,null,null,null,null,null,null,null,null,null,null,null,null,null,null,null,null,null,null,null,null,null,"1) Laskentakaava täyttöohjeessa"]
[null,"2) Verovuoden lopussa omistettujen metsien metsävähennyspohja yhteensä, ks. Täyttöohje",null,null,null,null,null,null,null,null,null,null,null,null,null,null,null,null,null,null,null,null,null,null,null,null,null,null,null,"2) Verovuoden lopussa omistettujen metsien metsävähennyspohja yhteensä, ks. täyttöohje"]
[null,"3) Metsävähennyksen määrä on enintään 60 % pääomatulosta, joka on saatu metsävähennykseen oikeuttavasta metsästä. Metsävähennyksen määrän on kuitenkin oltava vähintään 1 500 euroa ja korkeintaan kohdan 21 mukainen määrä. Siirretään kohtaan 5.1",null,null,null,null,null,null,null,null,null,null,null,null,null,null,null,null,null,null,null,null,null,null,null,null,null,null,null,"3) Metsävähennyksen määrä on enintään 60 % pääomatulosta, joka on saatu metsävähennykseen oikeuttavasta metsästä. Metsävähennyksen määrän on kuitenkin oltava vähintään 1 500 euroa ja korkeintaan kohdan 21 mukainen määrä. Siirretään kohtaan 5.1"]

{"sheet":"ALV-kausivero","index":14,"n_rows":48,"n_cols":17,"rows_kept":48,"cut":false,"hidden":false,"merged":[[12,1,12,9],[2,16,3,16]]}
[]
[null,{"$f":"Tulot!A2","v":"Metsätalouden kirjanpito"},null,null,null,null,"Mette 2016",null,null,null,null,"S","Kausiveroilmoitustietojen sähköinen ilmoittaminen"]
[null,"Alv-kausiveroilmoitusten koostetiedot",null,null,null,null,null,null,null,null,null,"Ä",null,null,null,null,"Huom! Siirtotiedoston luova makro toimii vain Windows Excelissä"]
[null,null,null,null,null,null,null,null,null,null,null,"H",null,"Tarkista lomakkeelle kerätyt tiedot sarakkeelta N. Lisää tarvittaessa puuttuva tieto tai korjaa virheellinen tieto. \nLopuksi luo siirtotiedosto painamalla  \"Luo siirtotiedosto\" nappia.\n\nHUOMAA! Siirtotiedosto luodaan makrolla, joka toimii Excel 2000 ja sitä uudemmassa Excelissä.\nMakro EI toimi Mac versioissa eikä OpenOffice Calcissa. (Solussa O4 ohje siirtotiedoston manuaaliseen tekemiseen.)","Ohje"]
[null,{"$f":"IF(Etusivu!C20=\"kyllä\",Etusivu!C10,\"EI ALV-VELVOLLINEN\")","v":"RAJOITETTU TESTIVESIO"},null,null,null,null,null,null,null,null,null,"K","Tunnus","Tieto","tunnus-tietopari","Kommentit","Kuvaus"]
[null,{"$f":"IF(Etusivu!C20=\"kyllä\",Etusivu!E10,\"\")","v":"Testitila 1:45"},null,null,null,null,null,null,null,null,null,"Ö","000","VSRALVKV",{"$f":"IF(N6=0,\"\",CONCATENATE(M6,\":\",N6))","v":"000:VSRALVKV"},"Yksilöi verolomakkeen","VSRALVKV = kausiveroilmoituslomake"]
[null,"Y-tunnus",null,{"$f":"IF(Etusivu!C20=\"kyllä\",Etusivu!C14,\"\")","v":"1322222-2"},null,null,null,null,null,null,null,"I","010",{"$f":"Etusivu!C14","v":"1322222-2"},"010:1322222-2",null,"Verovelvollisen henkilö- tai Y-tunnus"]
[null,null,null,null,null,null,null,null,null,null,null,"N","050",{"$f":"Etusivu!H21","v":"V"},"050:V","K Q tai V","Ilmoitusjakso (K=kuukausi, Q=4x/vuosi, V=vuosittain)"]
[null,"Ilmoita tiedot verottajalle sähköisesti osoitteessa www.vero.fi/verotili ",null,null,null,null,null,null,null,null,null,"E","052",{"$f":"IF(Etusivu!H21=\"V\",0,IF(LARGE('ALV-kausivero'!H24:H27,1)>=1,LARGE('ALV-kausivero'!H24:H27,1),IF(LARGE('ALV-kausivero'!H33:H44,1)>=1,LARGE('ALV-kausivero'!H33:H44,1),0)))","v":0},"",null,"Kohdekausi"]
[null,"Tätä lomaketta ei ole tehty alkuperäisen kausiveroilmoituslomakkeen muotoon, ",null,null,null,null,null,null,"Ohje",null,null,"N","053","2016","053:2016",null,"Kohdevuosi"]
[null,"koska veroviranomainen ei vastaanota taloushallinto-ohjelmista tulostettuja lomakkeita.",null,null,null,null,null,null,null,null,null,null,301,{"$f":"IF(Etusivu!H21=\"V\",D18,IF(Etusivu!H21=\"Q\",SUMIF(H24:H27,N9,D24:D27),IF(Etusivu!H21=\"K\",SUMIF(H33:H44,N9,D33:D44),5)))*100","v":1642800},"301:1642800","(1€=100)","Suoritettava 24 %:n vero kotimaan myynnistä"]
[null,null,null,null,null,null,null,null,null,null,null,"I",307,{"$f":"IF(Etusivu!H21=\"V\",E18,IF(Etusivu!H21=\"Q\",SUMIF(H24:H27,N9,E24:E27),IF(Etusivu!H21=\"K\",SUMIF(H33:H44,N9,E33:E44),5)))*100","v":70446},"307:70446","(1€=100)","Kohdekauden vähennettävä vero"]
[null,"Käytä yhtä alla olevista koostetietoalueista",null,null,null,null,null,null,null,null,null,"L",308,{"$f":"+N11-N12","v":1572354},"308:1572354","(1€=100)","Maksettava vero  / Palautukseen oikeuttava vero (-)"]
[null,null,"Kausiveroilmoitus kerran vuodessa",null,null,null,null,null,null,null,null,"M",315,null,{"$f":"IF(N14=0,\"\",CONCATENATE(M14,\":\",N14))","v":""},"lisää itse (1€=100)","Alarajahuojennukseen oikeuttava liikevaihto"]
[null,null,"Kerran vuodessa alv-ilmoitusvelvolliset voivat käyttää arvionvaraiset välilehteä.",null,null,null,null,{"$f":"IF(Etusivu!C21=\"kerran vuodessa\", \"Käytä näitä tietoja\", \" \")","v":"Käytä näitä tietoja"},null,null,null,"O",316,null,"","lisää itse (1€=100)","Alarajahuojennukseen oikeuttava vero"]
[null,null,null,301,307,308,null,null,null,null,null,"I",317,null,"","lisää itse (1€=100)","Alarajahuojennuksen määrä"]
[null,null,null,"Vero kotimaan myynnistä \nalv 24 %","Kohdekuukauden vähennettävä vero","Maksettava vero / palautukseen oikeuttava vero (-)","viimeinen maksu- päivä","ilmoitettu","maksettu",null,null,"T\nT\nA","054",null,"","lisää itse (1€=100)","Ei alv-toimintaa kohdekausi-alku"]
[null,null,{"$f":"CONCATENATE(\"Vuosi \",Etusivu!B7)","v":"Vuosi 2016"},{"$f":"SUM(D24:D27)","v":16428},{"$f":"Menot!I7","v":704.46},{"$f":"D18-E18","v":15723.54},"2017-02-28",null,null,null,null,"M","055",null,"","lisää itse (1€=100)","Ei alv-toimintaa kohdevuosi-alku  vvvv"]
[null,null,null,null,null,null,null,null,null,null,null,"I","056",null,"","lisää itse (1€=100)","Ei alv-toimintaa kohdekausi-loppu"]
[null,null,"Kausiveroilmoitus 4 kertaa vuodessa",null,null,null,null,null,null,null,null,"N","057",null,"","lisää itse (1€=100)","Ei alv-toimintaa kohdevuosi-loppu vvvv"]
[null,null,"Älä käytä arvionvaraiset välilehteä, jos olet alv-kausiveroilmoitusvelvollinen 4 kertaa vuodessa.",null,null,null,null,{"$f":"IF(Etusivu!C21=\"4 kertaa vuodessa\", \"Käytä näitä tietoja\", \" \")","v":" "},null,null,null,"E","042",{"$f":"Etusivu!C31","v":"Puhelinnumero"},"042:Puhelinnumero",null,"Yhteyshenkilön puhelinnumero"]
[null,null,null,301,307,308,null,null,null,null,null,"N","999",1,{"$f":"IF(N22=0,\"\",CONCATENATE(M22,\":\",N22))","v":"999:1"},null,"Lomakkeen loppumerkki"]
[null,null,null,"Vero kotimaan myynnistä \nalv 24 %","Kohdekuukauden vähennettävä vero","Maksettava vero / palautukseen oikeuttava vero (-)","viimeinen maksu- päivä","ilmoitettu","maksettu"]
[null,1,"tammi-maaliskuu",{"$f":"SUM(D33:D35)","v":0},{"$f":"SUM(E33:E35)","v":9.68},{"$f":"SUM(F33:F35)","v":-9.68},"2016-05-12",0]
[null,2,"Huhti-kesäkuu",{"$f":"SUM(D36:D38)","v":13584},{"$f":"SUM(E36:E38)","v":615.49},{"$f":"SUM(F36:F38)","v":12968.51},"2016-08-12",0]
[null,3,"Heinä-syyskuu",{"$f":"SUM(D39:D41)","v":2016},{"$f":"SUM(E39:E41)","v":63.66},{"$f":"SUM(F39:F41)","v":1952.34},"2016-11-12",0]
[null,4,"Loka-Joulukuu",{"$f":"SUM(D42:D44)","v":828},{"$f":"SUM(E42:E44)","v":0},{"$f":"SUM(F42:F44)","v":828},"2017-02-12",0]
[]
[null,null,"Kausiveroilmoitus kuukausittain"]
[null,null,"Älä käytä arvionvaraiset välilehteä, jos olet alv-kausiveroilmoitusvelvollinen 12 kertaa vuodessa.",null,null,null,null,{"$f":"IF(Etusivu!C21=\"kuukausittain\", \"Käytä näitä tietoja\", \" \")","v":" "}]
[null,null,null,301,307,308]
[null,null,null,"Vero kotimaan myynnistä \nalv 24 %","Kohdekuukauden vähennettävä vero","Maksettava vero / palautukseen oikeuttava vero (-)","viimeinen maksu- päivä","ilmoitettu","maksettu"]
[null,1,"Tammikuu",{"$f":"SUMIF(Tulot!C$9:C$163,B33,Tulot!L$9:L$163)+SUMIF(Luovutusv.!D$8:D$15,B33,Luovutusv.!I$8:I$15)","v":0},{"$f":"SUMIF(Menot!C$12:C$232,B33,Menot!I$12:I$232)","v":0},{"$f":"D33-E33","v":0},"2016-03-12",0]
[null,2,"Helmikuu",{"$f":"SUMIF(Tulot!C$9:C$163,B34,Tulot!L$9:L$163)+SUMIF(Luovutusv.!D$8:D$15,B34,Luovutusv.!I$8:I$15)","v":0},{"$f":"SUMIF(Menot!C$12:C$232,B34,Menot!I$12:I$232)","v":0},{"$f":"D34-E34","v":0},"2016-04-12",0]
[null,3,"Maaliskuu",{"$f":"SUMIF(Tulot!C$9:C$163,B35,Tulot!L$9:L$163)+SUMIF(Luovutusv.!D$8:D$15,B35,Luovutusv.!I$8:I$15)","v":0},{"$f":"SUMIF(Menot!C$12:C$232,B35,Menot!I$12:I$232)","v":9.68},-9.68,"2016-05-12",0]
[null,4,"Huhtikuu",{"$f":"SUMIF(Tulot!C$9:C$163,B36,Tulot!L$9:L$163)+SUMIF(Luovutusv.!D$8:D$15,B36,Luovutusv.!I$8:I$15)","v":0},{"$f":"SUMIF(Menot!C$12:C$232,B36,Menot!I$12:I$232)","v":464.52},-464.52,"2016-06-12",0]
[null,5,"Toukokuu",{"$f":"SUMIF(Tulot!C$9:C$163,B37,Tulot!L$9:L$163)+SUMIF(Luovutusv.!D$8:D$15,B37,Luovutusv.!I$8:I$15)","v":0},{"$f":"SUMIF(Menot!C$12:C$232,B37,Menot!I$12:I$232)","v":150.97},-150.97,"2016-07-12",0]
[null,6,"Kesäkuu",{"$f":"SUMIF(Tulot!C$9:C$163,B38,Tulot!L$9:L$163)+SUMIF(Luovutusv.!D$8:D$15,B38,Luovutusv.!I$8:I$15)","v":13584},{"$f":"SUMIF(Menot!C$12:C$232,B38,Menot!I$12:I$232)","v":0},13584,"2016-08-12",0]
[null,7,"Heinäkuu",{"$f":"SUMIF(Tulot!C$9:C$163,B39,Tulot!L$9:L$163)+SUMIF(Luovutusv.!D$8:D$15,B39,Luovutusv.!I$8:I$15)","v":0},{"$f":"SUMIF(Menot!C$12:C$232,B39,Menot!I$12:I$232)","v":1.94},-1.94,"2016-09-12",7]
[null,8,"Elokuu",{"$f":"SUMIF(Tulot!C$9:C$163,B40,Tulot!L$9:L$163)+SUMIF(Luovutusv.!D$8:D$15,B40,Luovutusv.!I$8:I$15)","v":0},{"$f":"SUMIF(Menot!C$12:C$232,B40,Menot!I$12:I$232)","v":0},0,"2016-10-12",0]
[null,9,"Syyskuu",{"$f":"SUMIF(Tulot!C$9:C$163,B41,Tulot!L$9:L$163)+SUMIF(Luovutusv.!D$8:D$15,B41,Luovutusv.!I$8:I$15)","v":2016},{"$f":"SUMIF(Menot!C$12:C$232,B41,Menot!I$12:I$232)","v":61.72},1954.28,"2016-11-12",0]
[null,10,"Lokakuu",{"$f":"SUMIF(Tulot!C$9:C$163,B42,Tulot!L$9:L$163)+SUMIF(Luovutusv.!D$8:D$15,B42,Luovutusv.!I$8:I$15)","v":0},{"$f":"SUMIF(Menot!C$12:C$232,B42,Menot!I$12:I$232)","v":0},0,"2016-12-12",0]
[null,11,"Marraskuu",{"$f":"SUMIF(Tulot!C$9:C$163,B43,Tulot!L$9:L$163)+SUMIF(Luovutusv.!D$8:D$15,B43,Luovutusv.!I$8:I$15)","v":828},{"$f":"SUMIF(Menot!C$12:C$232,B43,Menot!I$12:I$232)","v":0},828,"2017-01-12",0]
[null,12,"Joulukuu",{"$f":"SUMIF(Tulot!C$9:C$163,B44,Tulot!L$9:L$163)+SUMIF(Luovutusv.!D$8:D$15,B44,Luovutusv.!I$8:I$15)","v":0},{"$f":"SUMIF(Menot!C$12:C$232,B44,Menot!I$12:I$232)","v":0},0,"2017-02-12",0]
[]
[]
[null,"Lomake hakee alv-tulot lomakkeista \"Tulot\" ja \"Luovutusvoitot\""]
[null,"Lomake hakee alv-menot lomakkeista \"Menot\" ja \"Arvionvaraiset\" (Arvionvaraisista haetaan vain vuosi-ilmoitusosaan)"]

{"sheet":"Metsätalouden Tulos","index":15,"n_rows":38,"n_cols":5,"rows_kept":38,"cut":false,"hidden":false,"merged":[[2,1,2,5],[3,1,3,5]]}
[null,"Mette 2016"]
[null,{"$f":"Tulot!A2","v":"Metsätalouden kirjanpito"}]
[null,{"$f":"Etusivu!C10","v":"RAJOITETTU TESTIVESIO"}]
[null,{"$f":"Etusivu!E10","v":"Testitila 1:45"}]
[null,"Tilikauden tulos"]
[null,"Pääomatulot"]
["+","Puunmyyntitulot",{"$f":"Tulot!H8-SUM('Hank.työ 1'!C15:G15)-SUM('Hank.työ 2'!C15:G15)","v":59731.79}]
["+","Tuloutetut varaukset",{"$f":"Varaukset!E16+Varaukset!J16","v":3500}]
["+","Metsätalouden muut tulot, tuet ja korvaukset",{"$f":"Tulot!R7+Tulot!P7+Tulot!N7+Tulot!O7++SUM(Tulot!E171:J171)","v":1985}]
["+","Luovutusvoitot",{"$f":"Luovutusv.!H16","v":8400}]
[null,"Menot"]
["-","Menot",{"$f":"'2C'!T46","v":607.12}]
["-","Menovaraukset ja metsävähennys",{"$f":"'2C'!T38","v":34480.769999999997}]
["-","Poistot",{"$f":"'2C'!T56","v":1072.58}]
[]
["=","Tulos ennen veroja",null,{"$f":"C7+C8+C9+C10-C12-C13-C14","v":37456.32},{"$f":"IF(D16<0,\"  -\",\"  +\")","v":"  +"}]
[]
[null,"Pääomavero-% (alle 30 000 euron tulosta)",0.3]
[null,"Pääomavero-% (yli 30 000 euron tulosta)",0.34]
["-","Lopullinen vero",{"$f":"IF(D16>30000,(30000*C18)+((D16-30000)*C19),C18*D16)","v":11535.15}]
[null,"Maksetut ennakot",{"$f":"Tulot!$M$7","v":11803}]
["=","Pääomatulot verojen jälkeen",null,{"$f":"D16-C20","v":25921.17},{"$f":"IF(D22<0,\"  -\",\"  +\")","v":"  +"}]
[]
[" +","Metsätalouden verovapaa ansiotulo",{"$f":"SUM('Hank.työ 1'!C15:G15)-SUM('Hank.työ 1'!C16:G16)+SUM('Hank.työ 2'!C15:G15)-SUM('Hank.työ 2'!C16:G16)","v":318.20999999999998}]
[" +","Metsätalouden verollinen ansiotulo",{"$f":"SUM('Hank.työ 1'!C16:G16)+SUM('Hank.työ 2'!C16:G16)","v":0}]
[null,"Ansiotulojen vero %",0.21]
[" -","Verot metsätalouden ansiotöistä",{"$f":"C25*C26","v":0}]
[" =","Ansiotulot verojen jälkeen",null,{"$f":"C25+C24-C27","v":318.20999999999998}]
[]
[" =","Tulos ansiotöiden kanssa",null,{"$f":"D22+D28","v":26239.38},{"$f":"IF(D30<0,\"  -\",\"  +\")","v":"  +"}]
[]
[" +/-","Alijäämähyvitys (+) tai Lisävero (-)",null,{"$f":"C21-C20-C27","v":267.85000000000002},{"$f":"IF(D32<0,\"  -\",\"  +\")","v":"  +"}]
[]
[" +","Verovapaat tulot yhteensä",{"$f":"C24","v":318.20999999999998},{"$f":"IF(C34>0,\"  +\",\"  \")","v":"  +"}]
[" +","Verovapaiden tulojen verohyöty",{"$f":"+(C24*C26)","v":66.819999999999993},{"$f":"IF(C35>0,\"  +\",\"  \")","v":"  +"}]
[]
[" -","Maksettava arvonlisävero",{"$f":"IF('ALV-kausivero'!F18>0,'ALV-kausivero'!F18,0)","v":15723.54},{"$f":"IF(C37>0,\"   -\",\"  \")","v":"   -"}]
[" +","Palautettava arvonlisävero",{"$f":"-IF('ALV-kausivero'!F18<0.01,'ALV-kausivero'!F18,0)","v":0},{"$f":"IF(C38>0,\"  +\",\"  \")","v":"  "}]

{"sheet":"Sähköinen ilmoittaminen","index":16,"n_rows":185,"n_cols":15,"rows_kept":185,"cut":false,"hidden":false,"merged":[[2,11,2,13]]}
[null,null,null,null,null,null,null,null,null,null,null,"Mette 2016"]
[null,null,null,null,null,null,null,null,null,null,null,"Lomakkeen 2C tietojen sähköinen ilmoittaminen",null,null,"Huom! Siirtotiedoston luova makro toimii vain Windows Excelissä"]
[null,null,null,null,null,null,null,null,null,null,null,"Tarkista lomakkeelle kerätyt tiedot sarakkeelta L. Lisää tarvittaessa puuttuva tieto tai korjaa virheellinen tieto. \nLopuksi luo siirtotiedosto painamalla  \"Luo siirtotiedosto\" nappia.\n\nHUOMAA! Siirtotiedosto luodaan makrolla, joka toimii Excel 2000 ja sitä uudemmassa Excelissä.\nMakro EI toimi Mac versioissa eikä OpenOffice Calcissa. (Solussa O4 ohje siirtotiedoston manuaaliseen tekemiseen.)",null,null,"Ohje"]
["Tunnus",null,null,null,null,null,null,null,null,null,null,"Tieto","Kommentit","Kuvaus","tunnus-tietopari"]
["OTS",null,null,null,null,null,null,null,null,null,null,null,null,"Otsikko"]
["OT2",null,null,null,null,null,null,null,null,null,null,null,null,"Otsikko"]
["000",null,null,null,null,null,null,null,null,null,null,"VSY02C16","Yksilöi verolomakkeen","VSY02C16 = metsätalouden veroilmoituslomake 2016",{"$f":"IF(L7=0,\"\",CONCATENATE(A7,\":\",L7))","v":"000:VSY02C16"}]
["014",null,null,null,null,null,null,null,null,null,null,null,null,"Henkilönumero",""]
["198",null,null,null,null,null,null,null,null,null,null,null,"Operaattori täyttää","Lähetyspäivä ja -aika,  ilmoittaja täyttää, PPKKVVVVHHMMSS",""]
["197",null,null,null,null,null,null,null,null,null,null,null,"Verohallinto täyttää","Ilmoituksen saapumispäivä ja -aika sekunnin tarkkuudella, Verohallinto täyttää. Tieto saadaan lähetystiedoston nimestä, jonka lähettävä paketti tai Tyvi-operaattori on muodostanut",""]
["045",null,null,null,null,null,null,null,null,null,null,null,"Operaattori täyttää","Tieto lähettävästä paketista ja Tyvi-operaattorista (Tyvi-operaattori täyttää)",""]
["046",null,null,null,null,null,null,null,null,null,null,null,"Operaattori täyttää","Tieto lähettävän paketin versiosta (Tyvi-operaattori täyttää)",""]
["048",null,null,null,null,null,null,null,null,null,null,{"$f":"Etusivu!B4","v":"Mette 16.10 Forwood"},null,"Tieto lähettävästä ohjelmistosta","048:Mette 16.10 Forwood"]
["047",null,null,null,null,null,null,null,null,null,null,null,"Operaattori täyttää","Valtuutustieto (Tyvi-operaattori täyttää)",""]
["195",null,null,null,null,null,null,null,null,null,null,null,null,"Viimeinen palautuspäivä",""]
["988",null,null,null,null,null,null,null,null,null,null,null,null,"Valmisteluryhmä",""]
["989",null,null,null,null,null,null,null,null,null,null,null,null,"Esitäytön kieli, 1=suomi, 2=ruotsi",""]
["980",null,null,null,null,null,null,null,null,null,null,null,null,"Verohallinnon pääyksikkö",""]
["981",null,null,null,null,null,null,null,null,null,null,null,null,"Verohallinnon pääyksikön alayksikkö",""]
["982",null,null,null,null,null,null,null,null,null,null,null,null,"Palautuspaikan osoite, palautuspaikka on alayksikkö jos sellainen on muuten pääyksikkö",""]
["983",null,null,null,null,null,null,null,null,null,null,null,null,"Palautuspaikan postinumero",""]
["984",null,null,null,null,null,null,null,null,null,null,null,null,"Palautuspaikan postitoimipaikka",""]
["020",null,null,null,null,null,null,null,null,null,null,{"$f":"Etusivu!C10","v":"RAJOITETTU TESTIVESIO"},null,"Verovelvollisen nimi","020:RAJOITETTU TESTIVESIO"]
["031",null,null,null,null,null,null,null,null,null,null,{"$f":"Etusivu!C11","v":"Osoite"},null,"Verovelvollisen katuosoite tai postilokero","031:Osoite"]
["032",null,null,null,null,null,null,null,null,null,null,{"$f":"Etusivu!C12","v":"38210"},null,"Verovelvollisen postinumero","032:38210"]
["033",null,null,null,null,null,null,null,null,null,null,{"$f":"Etusivu!C13","v":"Sastamala"},null,"Verovelvollisen postitoimipaikka","033:Sastamala"]
["010",null,null,null,null,null,null,null,null,null,null,{"$f":"Etusivu!C14","v":"1322222-2"},null,"Verovelvollisen henkilö- tai Y-tunnus","010:1322222-2"]
["601",null,null,null,null,null,null,null,null,null,null,{"$f":"IF(Etusivu!C$23=\"kyllä\",0,'2C'!N16)","v":1},null,"Verovelvollisen osuus metsäomaisuudesta (%) (jos verotusyhtymä, tulostuu nolla, tunnus tietopari tyhjä)","601:1"]
["602",null,null,null,null,null,null,null,null,null,null,{"$f":"IF(Etusivu!C$23=\"kyllä\",0,'2C'!N17)","v":0},null,"Puolison osuus metsäomaisuudesta (%)  (jos verotusyhtymä, tulostuu nolla, tunnus tietopari tyhjä)",""]
["600",null,null,null,null,null,null,null,null,null,null,{"$f":"IF(COUNTBLANK('2C'!U16)=0,1,0)","v":0},null,"Oma erillinen ilmoitus (1=kyllä)",{"$f":"IF(L30=0,\"\",CONCATENATE(A30,\":\",L30))","v":""}]
["OTS",null,null,null,null,null,null,null,null,null,null,null,null,"Otsikko"]
["OT2",null,null,null,null,null,null,null,null,null,null,null,null,"Otsikko"]
[603,null,null,null,null,null,null,null,null,null,null,{"$f":"'2C'!C23","v":56600},null,"Puun myyntitulot, pystykaupat",{"$f":"IF(L33=0,\"\",CONCATENATE(A33,\":\",L33))","v":"603:56600"}]
[604,null,null,null,null,null,null,null,null,null,null,{"$f":"'2C'!G23","v":3450},null,"Puun myyntitulot, hankintakaupat","604:3450"]
[613,null,null,null,null,null,null,null,null,null,null,{"$f":"'2C'!M23","v":0},null,"Puun myyntitulot, poltto- ja joulupuukaupat",""]
[690,null,null,null,null,null,null,null,null,null,null,{"$f":"'2C'!T23","v":60050},null,"Puun myyntitulot yhteensä (603+604+613)","690:60050"]
["605",null,null,null,null,null,null,null,null,null,null,{"$f":"'2C'!G27","v":318.20999999999998},null,"Hankintatyön arvo, hankintakaupat","605:318,21"]
[625,null,null,null,null,null,null,null,null,null,null,{"$f":"'2C'!M27","v":0},null,"Hankintatyön arvo, poltto- ja joulupuukaupat",""]
[691,null,null,null,null,null,null,null,null,null,null,{"$f":"'2C'!T27","v":318.20999999999998},null,"Hankintatyön arvo yhteensä (606+625)","691:318,21"]
["OT2",null,null,null,null,null,null,null,null,null,null,null,null,"Otsikko"]
["607",null,null,null,null,null,null,null,null,null,null,{"$f":"'2C'!C31","v":1230},null,"Vakuutuskorvaukset",{"$f":"IF(L41=0,\"\",CONCATENATE(A41,\":\",L41))","v":"607:1230"}]
["608",null,null,null,null,null,null,null,null,null,null,{"$f":"'2C'!G31","v":0},null,"Hirvivahinkokorvaukset",{"$f":"IF(L42=0,\"\",CONCATENATE(A42,\":\",L42))","v":""}]
["609",null,null,null,null,null,null,null,null,null,null,{"$f":"'2C'!M31","v":440},null,"Metsätalouden tuet",{"$f":"IF(L43=0,\"\",CONCATENATE(A43,\":\",L43))","v":"609:440"}]
["610",null,null,null,null,null,null,null,null,null,null,{"$f":"'2C'!T31","v":1670},null,"Vakuutus- ja hirvivahinkokorvaukset, metsätalouden tuet yhteensä (607+608+609)",{"$f":"IF(L44=0,\"\",CONCATENATE(A44,\":\",L44))","v":"610:1670"}]
["OT2",null,null,null,null,null,null,null,null,null,null,null,null,"Otsikko"]
["611",null,null,null,null,null,null,null,null,null,null,{"$f":"'2C'!D34","v":0},null,"Maatalouskäyttö",{"$f":"IF(L46=0,\"\",CONCATENATE(A46,\":\",L46))","v":""}]
["612",null,null,null,null,null,null,null,null,null,null,{"$f":"'2C'!G34","v":0},null,"Elinkeinokäyttö",{"$f":"IF(L47=0,\"\",CONCATENATE(A47,\":\",L47))","v":""}]
["692",null,null,null,null,null,null,null,null,null,null,{"$f":"'2C'!M34","v":315},null,"Yksityiskäyttö",{"$f":"IF(L48=0,\"\",CONCATENATE(A48,\":\",L48))","v":"692:315"}]
["614",null,null,null,null,null,null,null,null,null,null,{"$f":"'2C'!T34","v":315},null,"Omasta metsästä otettu puutavara yhteensä (611+612+613)",{"$f":"IF(L49=0,\"\",CONCATENATE(A49,\":\",L49))","v":"614:315"}]
["OT2",null,null,null,null,null,null,null,null,null,null,null,null,"Otsikko"]
["615",null,null,null,null,null,null,null,null,null,null,{"$f":"'2C'!C38","v":28500},null,"Metsävähennys",{"$f":"IF(L51=0,\"\",CONCATENATE(A51,\":\",L51))","v":"615:28500"}]
["616",null,null,null,null,null,null,null,null,null,null,{"$f":"'2C'!G38","v":4750.7700000000004},null,"Menovaraus",{"$f":"IF(L52=0,\"\",CONCATENATE(A52,\":\",L52))","v":"616:4750,77"}]
["617",null,null,null,null,null,null,null,null,null,null,{"$f":"'2C'!M38","v":1230},null,"Tuhovaraus",{"$f":"IF(L53=0,\"\",CONCATENATE(A53,\":\",L53))","v":"617:1230"}]
["618",null,null,null,null,null,null,null,null,null,null,{"$f":"'2C'!T38","v":34480.769999999997},null,"Metsävähennys ja varaukset yhteensä (615+616+617)",{"$f":"IF(L54=0,\"\",CONCATENATE(A54,\":\",L54))","v":"618:34480,77"}]
["OT2",null,null,null,null,null,null,null,null,null,null,null,null,"Otsikko"]
["619",null,null,null,null,null,null,null,null,null,null,{"$f":"'2C'!G42","v":3500},null,"Varausten tuloutus",{"$f":"IF(L56=0,\"\",CONCATENATE(A56,\":\",L56))","v":"619:3500"}]
["620",null,null,null,null,null,null,null,null,null,null,{"$f":"'2C'!M42","v":0},null,"Muut pääomatuloksi luettavat erät",{"$f":"IF(L57=0,\"\",CONCATENATE(A57,\":\",L57))","v":""}]
[651,null,null,null,null,null,null,null,null,null,null,{"$f":"'2C'!T42","v":3500},null,"Muut pääomatuloksi luettavat erät yhteensä (619+621+620)",{"$f":"IF(L58=0,\"\",CONCATENATE(A58,\":\",L58))","v":"651:3500"}]
["OT2",null,null,null,null,null,null,null,null,null,null,null,null,"Otsikko"]
["622",null,null,null,null,null,null,null,null,null,null,{"$f":"'2C'!C46","v":0},null,"Palkkausmenot",{"$f":"IF(L60=0,\"\",CONCATENATE(A60,\":\",L60))","v":""}]
["623",null,null,null,null,null,null,null,null,null,null,{"$f":"'2C'!G46","v":31.44},null,"Matkakulut",{"$f":"IF(L61=0,\"\",CONCATENATE(A61,\":\",L61))","v":"623:31,44"}]
["624",null,null,null,null,null,null,null,null,null,null,{"$f":"'2C'!M46","v":575.67999999999995},null,"Muut vuosimenot",{"$f":"IF(L62=0,\"\",CONCATENATE(A62,\":\",L62))","v":"624:575,68"}]
[693,null,null,null,null,null,null,null,null,null,null,{"$f":"'2C'!T46","v":607.12},null,"Vuosimenot yhteensä (622+623+624)",{"$f":"IF(L63=0,\"\",CONCATENATE(A63,\":\",L63))","v":"693:607,12"}]
["OT2",null,null,null,null,null,null,null,null,null,null,null,null,"Otsikko"]
[660,null,null,null,null,null,null,null,null,null,null,{"$f":"'2C'!F50","v":2500},null,"Menojäännös 1.1.2016 Koneet ja kalusto",{"$f":"IF(L65=0,\"\",CONCATENATE(A65,\":\",L65))","v":"660:2500"}]
[670,null,null,null,null,null,null,null,null,null,null,{"$f":"'2C'!I50","v":0},null,"Menojäännös 1.1.2016 Rakennukset",""]
[680,null,null,null,null,null,null,null,null,null,null,{"$f":"'2C'!N50","v":0},null,"Menojäännös 1.1.2016 Ojat ja tiet",""]
[661,null,null,null,null,null,null,null,null,null,null,{"$f":"'2C'!F52","v":629.03},null,"Lisäykset verovuonna: Koneet ja kalusto","661:629,03"]
[671,null,null,null,null,null,null,null,null,null,null,{"$f":"'2C'!I52","v":0},null,"Lisäykset verovuonna: Rakennukset",""]
[681,null,null,null,null,null,null,null,null,null,null,{"$f":"'2C'!N52","v":1935.48},null,"Lisäykset verovuonna: Ojat ja tiet","681:1935,48"]
[645,null,null,null,null,null,null,null,null,null,null,{"$f":"'2C'!F54","v":0},null,"Luovutukset verovuonna: Koneet ja kalusto",""]
[646,null,null,null,null,null,null,null,null,null,null,{"$f":"'2C'!I54","v":0},null,"Luovutukset verovuonna: Rakennukset",""]
[682,null,null,null,null,null,null,null,null,null,null,{"$f":"'2C'!N54","v":0},null,"Luovutukset verovuonna: Ojat ja tiet",""]
[642,null,null,null,null,null,null,null,null,null,null,{"$f":"'2C'!F56","v":782.26},null,"Poistot: Koneet ja kalusto","642:782,26"]
[643,null,null,null,null,null,null,null,null,null,null,{"$f":"'2C'!I56","v":0},null,"Poistot: Rakennukset",""]
[644,null,null,null,null,null,null,null,null,null,null,{"$f":"'2C'!N56","v":290.32},null,"Poistot: Ojat ja tiet","644:290,32"]
[694,null,null,null,null,null,null,null,null,null,null,{"$f":"'2C'!T56","v":1072.58},null,"Poistot yhteensä (642+643+644)",{"$f":"IF(L77=0,\"\",CONCATENATE(A77,\":\",L77))","v":"694:1072,58"}]
["626",null,null,null,null,null,null,null,null,null,null,{"$f":"'2C'!F58","v":2346.77},null,"Menojäännös 31.12.2016: Koneet ja kalusto","626:2346,77"]
["627",null,null,null,null,null,null,null,null,null,null,{"$f":"'2C'!I58","v":0},null,"Menojäännös 31.12.2016: Rakennukset",""]
["628",null,null,null,null,null,null,null,null,null,null,{"$f":"'2C'!N58","v":1645.16},null,"Menojäännös 31.12.2016: Ojat ja tiet","628:1645,16"]
["630",null,null,null,null,null,null,null,null,null,null,{"$f":"'2C'!T60","v":0},null,"Toisesta tulolähteestä siirrettävät menot",""]
["631",null,null,null,null,null,null,null,null,null,null,{"$f":"'2C'!C63","v":0},null,"Maatalouden menot",""]
["632",null,null,null,null,null,null,null,null,null,null,{"$f":"'2C'!G63","v":0},null,"Elinkeinotoiminnan menot",""]
["633",null,null,null,null,null,null,null,null,null,null,{"$f":"'2C'!M63","v":0},null,"Yksityismenot",""]
["634",null,null,null,null,null,null,null,null,null,null,{"$f":"'2C'!T62","v":0},null,"Metsätalouden muistiinpanoihin sisältyneet muun toiminnan menot yhteensä (631+632+633)",""]
["635",null,null,null,null,null,null,null,null,null,null,{"$f":"'2C'!T65","v":29056.32},null,"15. Metsätalouden puhdas pääomatulo (690+691+610+614-618+651-693-694-630+634)",{"$f":"IF(L86=\"\",\"\",CONCATENATE(A86,\":\",L86))","v":"635:29056,32"}]
["636",null,null,null,null,null,null,null,null,null,null,{"$f":"IF('2C'!T67<0,ABS('2C'!T67),0)","v":0},null,"16. Metsätalouden tappiollinen pääomatulo -(690+691+610+614-618+651-693-694-630+634)",{"$f":"IF(L87=0,\"\",CONCATENATE(A87,\":\",L87))","v":""}]
["OTS",null,null,null,null,null,null,null,null,null,null,null,null,"Otsikko"]
["001",null,null,null,null,null,null,null,null,null,null,{"$f":"8-(COUNTBLANK('2C'!B76)+COUNTBLANK('2C'!B78)+COUNTBLANK('2C'!B80)+COUNTBLANK('2C'!B82)+COUNTBLANK('2C'!AD76)+COUNTBLANK('2C'!AD78)+COUNTBLANK('2C'!AD80)+COUNTBLANK('2C'!AD82))","v":1},null,"Osatietoryhmä 700-705 alkaa",{"$f":"IF(L89=0,\"\",CONCATENATE(A89,\":\",L89))","v":"001:1"}]
["700",null,null,null,null,null,null,null,null,null,null,{"$f":"'2C'!B76","v":"Matti testimetsänomistaja"},null,"Hankintatyön tekijän nimi","700:Matti testimetsänomistaja"]
["701",null,null,null,null,null,null,null,null,null,null,{"$f":"'2C'!G76","v":"060660-0606"},null,"Hankintatyön tekijän henkilötunnus","701:060660-0606"]
["702",null,null,null,null,null,null,null,null,null,null,{"$f":"'2C'!J76","v":21},null,"Valmistettu määrä m3","702:21"]
["703",null,null,null,null,null,null,null,null,null,null,{"$f":"'2C'!M76","v":21},null,"Kuljetettu määrä m3","703:21"]
["704",null,null,null,null,null,null,null,null,null,null,{"$f":"'2C'!O76","v":318.20999999999998},null,"Hankintatyön arvo","704:318,21"]
["705",null,null,null,null,null,null,null,null,null,null,{"$f":"'2C'!S77","v":0},null,"Hankintatyön veronalainen arvo",""]
["OHJ"]
["009",null,null,null,null,null,null,null,null,null,null,{"$f":"IF(L$89>0,1,\"\")","v":1},"Juokseva numero osatietoryhmien määrän mukaan","Osatietoryhmä 700-705 loppuu",{"$f":"IF(L97=\"\",\"\",CONCATENATE(A97,\":\",L97))","v":"009:1"}]
["700",null,null,null,null,null,null,null,null,null,null,{"$f":"'2C'!B78","v":0},null,"Hankintatyön tekijän nimi",{"$f":"IF(L98=0,\"\",CONCATENATE(A98,\":\",L98))","v":""}]
["701",null,null,null,null,null,null,null,null,null,null,{"$f":"'2C'!G78","v":0},null,"Hankintatyön tekijän henkilötunnus",""]
["702",null,null,null,null,null,null,null,null,null,null,{"$f":"'2C'!J78","v":0},null,"Valmistettu määrä m3",""]
["703",null,null,null,null,null,null,null,null,null,null,{"$f":"'2C'!M78","v":0},null,"Kuljetettu määrä m3",""]
["704",null,null,null,null,null,null,null,null,null,null,{"$f":"'2C'!O78","v":0},null,"Hankintatyön arvo",""]
["705",null,null,null,null,null,null,null,null,null,null,{"$f":"'2C'!S79","v":0},null,"Hankintatyön veronalainen arvo",""]
["OHJ"]
["009",null,null,null,null,null,null,null,null,null,null,{"$f":"IF(L$89>1,2,\"\")","v":""},"Juokseva numero osatietoryhmien määrän mukaan","Osatietoryhmä 700-705 loppuu",{"$f":"IF(L105=\"\",\"\",CONCATENATE(A105,\":\",L105))","v":""}]
["700",null,null,null,null,null,null,null,null,null,null,{"$f":"'2C'!B80","v":0},null,"Hankintatyön tekijän nimi",{"$f":"IF(L106=0,\"\",CONCATENATE(A106,\":\",L106))","v":""}]
["701",null,null,null,null,null,null,null,null,null,null,{"$f":"'2C'!G80","v":0},null,"Hankintatyön tekijän henkilötunnus",""]
["702",null,null,null,null,null,null,null,null,null,null,{"$f":"'2C'!J80","v":0},null,"Valmistettu määrä m3",""]
["703",null,null,null,null,null,null,null,null,null,null,{"$f":"'2C'!M80","v":0},null,"Kuljetettu määrä m3",""]
["704",null,null,null,null,null,null,null,null,null,null,{"$f":"'2C'!O80","v":0},null,"Hankintatyön arvo",""]
["705",null,null,null,null,null,null,null,null,null,null,{"$f":"'2C'!S81","v":0},null,"Hankintatyön veronalainen arvo",""]
["OHJ"]
["009",null,null,null,null,null,null,null,null,null,null,{"$f":"IF(L$89>2,3,\"\")","v":""},"Juokseva numero osatietoryhmien määrän mukaan","Osatietoryhmä 700-705 loppuu",{"$f":"IF(L113=\"\",\"\",CONCATENATE(A113,\":\",L113))","v":""}]
["700",null,null,null,null,null,null,null,null,null,null,{"$f":"'2C'!B82","v":0},null,"Hankintatyön tekijän nimi",{"$f":"IF(L114=0,\"\",CONCATENATE(A114,\":\",L114))","v":""}]
["701",null,null,null,null,null,null,null,null,null,null,{"$f":"'2C'!G82","v":0},null,"Hankintatyön tekijän henkilötunnus",""]
["702",null,null,null,null,null,null,null,null,null,null,{"$f":"'2C'!J82","v":0},null,"Valmistettu määrä m3",""]
["703",null,null,null,null,null,null,null,null,null,null,{"$f":"'2C'!M82","v":0},null,"Kuljetettu määrä m3",""]
["704",null,null,null,null,null,null,null,null,null,null,{"$f":"'2C'!O82","v":0},null,"Hankintatyön arvo",""]
["705",null,null,null,null,null,null,null,null,null,null,{"$f":"'2C'!S83","v":0},null,"Hankintatyön veronalainen arvo",""]
["OHJ"]
["009",null,null,null,null,null,null,null,null,null,null,{"$f":"IF(L$89>3,4,\"\")","v":""},"Juokseva numero osatietoryhmien määrän mukaan","Osatietoryhmä 700-705 loppuu",{"$f":"IF(L121=\"\",\"\",CONCATENATE(A121,\":\",L121))","v":""}]
["700",null,null,null,null,null,null,null,null,null,null,{"$f":"'2C'!AD76","v":0},null,"Hankintatyön tekijän nimi",{"$f":"IF(L122=0,\"\",CONCATENATE(A122,\":\",L122))","v":""}]
["701",null,null,null,null,null,null,null,null,null,null,{"$f":"'2C'!AI76","v":0},null,"Hankintatyön tekijän henkilötunnus",""]
["702",null,null,null,null,null,null,null,null,null,null,{"$f":"'2C'!AL76","v":0},null,"Valmistettu määrä m3",""]
["703",null,null,null,null,null,null,null,null,null,null,{"$f":"'2C'!AO76","v":0},null,"Kuljetettu määrä m3",""]
["704",null,null,null,null,null,null,null,null,null,null,{"$f":"'2C'!AQ76","v":0},null,"Hankintatyön arvo",""]
["705",null,null,null,null,null,null,null,null,null,null,{"$f":"'2C'!AU77","v":0},null,"Hankintatyön veronalainen arvo",""]
["OHJ"]
["009",null,null,null,null,null,null,null,null,null,null,{"$f":"IF(L$89>4,5,\"\")","v":""},"Juokseva numero osatietoryhmien määrän mukaan","Osatietoryhmä 700-705 loppuu",{"$f":"IF(L129=\"\",\"\",CONCATENATE(A129,\":\",L129))","v":""}]
["700",null,null,null,null,null,null,null,null,null,null,{"$f":"'2C'!AD78","v":0},null,"Hankintatyön tekijän nimi",{"$f":"IF(L130=0,\"\",CONCATENATE(A130,\":\",L130))","v":""}]
["701",null,null,null,null,null,null,null,null,null,null,{"$f":"'2C'!AI78","v":0},null,"Hankintatyön tekijän henkilötunnus",""]
["702",null,null,null,null,null,null,null,null,null,null,{"$f":"'2C'!AL78","v":0},null,"Valmistettu määrä m3",""]
["703",null,null,null,null,null,null,null,null,null,null,{"$f":"'2C'!AO78","v":0},null,"Kuljetettu määrä m3",""]
["704",null,null,null,null,null,null,null,null,null,null,{"$f":"'2C'!AQ78","v":0},null,"Hankintatyön arvo",""]
["705",null,null,null,null,null,null,null,null,null,null,{"$f":"'2C'!AU79","v":0},null,"Hankintatyön veronalainen arvo",""]
["OHJ"]
["009",null,null,null,null,null,null,null,null,null,null,{"$f":"IF(L$89>5,6,\"\")","v":""},"Juokseva numero osatietoryhmien määrän mukaan","Osatietoryhmä 700-705 loppuu",{"$f":"IF(L137=\"\",\"\",CONCATENATE(A137,\":\",L137))","v":""}]
["700",null,null,null,null,null,null,null,null,null,null,{"$f":"'2C'!AD80","v":0},null,"Hankintatyön tekijän nimi",{"$f":"IF(L138=0,\"\",CONCATENATE(A138,\":\",L138))","v":""}]
["701",null,null,null,null,null,null,null,null,null,null,{"$f":"'2C'!AI80","v":0},null,"Hankintatyön tekijän henkilötunnus",""]
["702",null,null,null,null,null,null,null,null,null,null,{"$f":"'2C'!AL80","v":0},null,"Valmistettu määrä m3",""]
["703",null,null,null,null,null,null,null,null,null,null,{"$f":"'2C'!AO80","v":0},null,"Kuljetettu määrä m3",""]
["704",null,null,null,null,null,null,null,null,null,null,{"$f":"'2C'!AQ80","v":0},null,"Hankintatyön arvo",""]
["705",null,null,null,null,null,null,null,null,null,null,{"$f":"'2C'!AU81","v":0},null,"Hankintatyön veronalainen arvo",""]
["OHJ"]
["009",null,null,null,null,null,null,null,null,null,null,{"$f":"IF(L$89>6,7,\"\")","v":""},"Juokseva numero osatietoryhmien määrän mukaan","Osatietoryhmä 700-705 loppuu",{"$f":"IF(L145=\"\",\"\",CONCATENATE(A145,\":\",L145))","v":""}]
["700",null,null,null,null,null,null,null,null,null,null,{"$f":"'2C'!AD82","v":0},null,"Hankintatyön tekijän nimi",{"$f":"IF(L146=0,\"\",CONCATENATE(A146,\":\",L146))","v":""}]
["701",null,null,null,null,null,null,null,null,null,null,{"$f":"'2C'!AI82","v":0},null,"Hankintatyön tekijän henkilötunnus",""]
["702",null,null,null,null,null,null,null,null,null,null,{"$f":"'2C'!AL82","v":0},null,"Valmistettu määrä m3",""]
["703",null,null,null,null,null,null,null,null,null,null,{"$f":"'2C'!AO82","v":0},null,"Kuljetettu määrä m3",""]
["704",null,null,null,null,null,null,null,null,null,null,{"$f":"'2C'!AQ82","v":0},null,"Hankintatyön arvo",""]
["705",null,null,null,null,null,null,null,null,null,null,{"$f":"'2C'!AU83","v":0},null,"Hankintatyön veronalainen arvo",""]
["OHJ"]
["009",null,null,null,null,null,null,null,null,null,null,{"$f":"IF(L$89>7,8,\"\")","v":""},"Juokseva numero osatietoryhmien määrän mukaan","Osatietoryhmä 700-705 loppuu",{"$f":"IF(L153=\"\",\"\",CONCATENATE(A153,\":\",L153))","v":""}]
["706",null,null,null,null,null,null,null,null,null,null,{"$f":"'2C'!O84+'2C'!AQ84","v":318.20999999999998},null,"Hankintatyön arvot yhteensä",{"$f":"IF(L154=0,\"\",CONCATENATE(A154,\":\",L154))","v":"706:318,21"}]
["OTS",null,null,null,null,null,null,null,null,null,null,null,null,"Otsikko"]
["OT2",null,null,null,null,null,null,null,null,null,null,null,null,"Otsikko"]
[655,null,null,null,null,null,null,null,null,null,null,{"$f":"'2C'!G89","v":33000},null,"Metsävähennyspohja, ks. täyttöohje",{"$f":"IF(L157=0,\"\",CONCATENATE(A157,\":\",L157))","v":"655:33000"}]
["656",null,null,null,null,null,null,null,null,null,null,{"$f":"'2C'!G90","v":4500},null,"Aikaisemmin käytetty metsävähennys","656:4500"]
["657",null,null,null,null,null,null,null,null,null,null,{"$f":"'2C'!G91","v":0},null,"Luovutusvoittoihin lisättyjen metsävähennysten määrä",""]
["715",null,null,null,null,null,null,null,null,null,null,{"$f":"'2C'!F92","v":28500},null,"Käytettävissä olevan metsävähennyksen määrä = 655 - (656 - 657)","715:28500"]
["716",null,null,null,null,null,null,null,null,null,null,{"$f":"'2C'!R89","v":60046.79},null,"Metsätalouden veronalainen pääomatulo metsävähennyskiinteistöiltä verovuonna","716:60046,79"]
["717",null,null,null,null,null,null,null,null,null,null,{"$f":"'2C'!R90","v":28500},null,"Verovuoden metsävähennys","717:28500"]
["OHJ"]
["720",null,null,null,null,null,null,null,null,null,null,{"$f":"'2C'!R91","v":33000},null,"Käytetty metsävähennys yhteensä = 656+717",{"$f":"IF(L164=0,\"\",CONCATENATE(A164,\":\",L164))","v":"720:33000"}]
["OTS",null,null,null,null,null,null,null,null,null,null,null,null,"otsikko"]
["OT2",null,null,null,null,null,null,null,null,null,null,null,null,"otsikko"]
["637",null,null,null,null,null,null,null,null,null,null,{"$f":"'2C'!B99","v":0},null,"Vuonna 2011 tehtyjen menovarausten jäljellä oleva määrä vuoden 2016 lopussa",{"$f":"IF(L167=0,\"\",CONCATENATE(A167,\":\",L167))","v":""}]
["638",null,null,null,null,null,null,null,null,null,null,{"$f":"'2C'!E99","v":0},null,"Vuonna 2012 tehtyjen menovarausten jäljellä oleva määrä vuoden 2016 lopussa",""]
["639",null,null,null,null,null,null,null,null,null,null,{"$f":"'2C'!G99","v":1200},null,"Vuonna 2013 tehtyjen menovarausten jäljellä oleva määrä vuoden 2016 lopussa","639:1200"]
["640",null,null,null,null,null,null,null,null,null,null,{"$f":"'2C'!J99","v":6430},null,"Vuonna 204 tehtyjen menovarausten jäljellä oleva määrä vuoden 2016 lopussa","640:6430"]
["641",null,null,null,null,null,null,null,null,null,null,{"$f":"'2C'!O99","v":0},null,"Vuonna 2015 tehtyjen menovarausten jäljellä oleva määrä vuoden 2016 lopussa",""]
["650",null,null,null,null,null,null,null,null,null,null,{"$f":"'2C'!T99","v":4750.7700000000004},null,"Vuonna 2016 tehtyjen menovarausten jäljellä oleva määrä vuoden 2016 lopussa","650:4750,77"]
["842",null,null,null,null,null,null,null,null,null,null,{"$f":"'2C'!B101","v":0},null,"Vuonna 2011 tehtyjen tuhovarausten jäljellä oleva määrä vuoden 2016 lopussa",""]
["843",null,null,null,null,null,null,null,null,null,null,{"$f":"'2C'!E101","v":0},null,"Vuonna 2012 tehtyjen tuhovarausten jäljellä oleva määrä vuoden 2016 lopussa",""]
["844",null,null,null,null,null,null,null,null,null,null,{"$f":"'2C'!G101","v":0},null,"Vuonna 2013 tehtyjen tuhovarausten jäljellä oleva määrä vuoden 2016 lopussa",""]
["845",null,null,null,null,null,null,null,null,null,null,{"$f":"'2C'!J101","v":0},null,"Vuonna 2014 tehtyjen tuhovarausten jäljellä oleva määrä vuoden 2016 lopussa",""]
["846",null,null,null,null,null,null,null,null,null,null,{"$f":"'2C'!O101","v":0},null,"Vuonna 2015 tehtyjen tuhovarausten jäljellä oleva määrä vuoden 2016 lopussa",""]
["851",null,null,null,null,null,null,null,null,null,null,{"$f":"'2C'!T101","v":1230},null,"Vuonna 2016 tehtyjen tuhovarausten jäljellä oleva määrä vuoden 2016 lopussa","851:1230"]
["OTS",null,null,null,null,null,null,null,null,null,null,null,null,"otsikko"]
["OT2",null,null,null,null,null,null,null,null,null,null,null,null,"otsikko"]
["041",null,null,null,null,null,null,null,null,null,null,{"$f":"'2C'!B107","v":"Nimi"},null,"Veroilmoitusta täydentäviä tietoja antaa, nimi",{"$f":"IF(L181=0,\"\",CONCATENATE(A181,\":\",L181))","v":"041:Nimi"}]
["044",null,null,null,null,null,null,null,null,null,null,{"$f":"'2C'!B108","v":"Sähköpostiosoite"},null,"Veroilmoitusta täydentävien tietojen antajan sähköpostiosoite",{"$f":"IF(L182=0,\"\",CONCATENATE(A182,\":\",L182))","v":"044:Sähköpostiosoite"}]
["042",null,null,null,null,null,null,null,null,null,null,{"$f":"Etusivu!C31","v":"Puhelinnumero"},null,"Veroilmoitusta täydentäviä tietoja antavan puhelinnumero",{"$f":"IF(L183=0,\"\",CONCATENATE(A183,\":\",L183))","v":"042:Puhelinnumero"}]
[928,null,null,null,null,null,null,null,null,null,null,{"$f":"IF(COUNTBLANK('2C'!B111)=0,1,0)","v":0},null,"Vapaamuotoisia liitteitä (1=kyllä)",{"$f":"IF(L184=0,\"\",CONCATENATE(A184,\":\",L184))","v":""}]
["999",null,null,null,null,null,null,null,null,null,null,1,null,"Lomakkeen 2C loppumerkki",{"$f":"IF(L185=0,\"\",CONCATENATE(A185,\":\",L185))","v":"999:1"}]

{"sheet":"OHJE Sähk.ilm.","index":17,"n_rows":12,"n_cols":2,"rows_kept":12,"cut":false,"hidden":false,"merged":[[39,0,39,5],[27,0,27,5],[29,0,29,5],[32,0,32,5],[35,0,35,5],[15,0,15,4],[20,0,20,4],[21,0,21,4],[24,0,24,4],[37,0,37,5]]}
[null,"Mette 2016"]
[null,{"$f":"Tulot!A2","v":"Metsätalouden kirjanpito"}]
[null,"Ohje sähköisen ilmoittamisen käyttöön"]
[]
[]
[null,"Verottaja vastaanottaa veroilmoituksia sähköisesti. Ilmoittaminen tapahtuu lähettämällä kirjanpito-ohjelman sitä varten tuottama tiedosto Ilmoitin-palvelun kautta (siirtotiedosto tehdään välilehdellä \"Sähköinen ilmoittaminen). \n\nSähköisen tiedoston lähetys on mahdollista kaikille, joilla on Y-tunnus hankkimalla Katso-tunnukset ja lähettämällä tiedosto Ilmoitin-palvelun kautta. Katso-tunnuksia myönnetään myös yhtymille ja lähitulevaisuudessa myös kuolinpesille, kaikille, joilla on y-tunnus. \n\nKatso-tunnukset palvelun käyttämiseksi hankitaan osoitteesta https://yritys.tunnistus.fi/main \n\nIlmoitin löytyy osoitteesta https://www.ilmoitin.fi/\nTäytettävä metsätalouden verkkoveroilmoituslomake 2C löytyy osoitteesta suomi.fi/asiointi. Hakusana 2C"]
[null,"Lomake Sähköinen ilmoittaminen\nOhjelma hakee verotiedot lomakkeelle \"Sähköinen ilmoittaminen\", jossa sarakkeella C on veroilmoituksen kohdan tunnus ja kyseisen lomakekohdan arvo on sarakkeella L. Tunnus liitetään sarakkeen (L) arvoon sarakkeessa O, joka lähetetään siirtotiedostona verottajalle ilmoitin palvelun kautta.\n\nTiettyjä tietoja tulee tarkistaa tai lisätä vielä lomakkeella \"Sähköinen ilmoittamien\". Pakolliset kentät ovat vihreällä pohjalla. Vapaaehtoiset keltaisella."]
[]
[null,"Siirtotiedoston tekeminen\n2C ja ALV kausi-ilmoitus\nTarkista vielä tiedot sarakkeella L (samat tiedot on sarakkeella L yhdistettynä tunnukseen). \nÄlä mielellään koske Sarakkeella O olevaan arvoon.\nSiirtotiedosto tehdään klikkaamalla painiketta \"Luo siirtotiedosto\".\nOhjelma kysyy siirtotiedoston tallennuskansiota ja nimeä. \nVoit nimetä tiedoston vapaasti.\nTiedoston tallennusmuodoksi tulee valita txt."]
[]
[null,"Sähköisen ilmoitusaineiston tarkastus\nSiirry osoitteeseen https://www.ilmoitin.fi/. Valitse sieltä kohta aineiston tarkastus.\nVoit tarkistaa, että Metten tekemä aineisto, eli siirtotiedosto on muodollisesti oikein. Korjaa tarvittaessa kirjanpitoasi, kunnes siirtotiedosto läpäisee oikeellisuustarkistuksen."]
[null,"Sähköisen ilmoituksen lähettäminen\nOsoitteessa https://www.ilmoitin.fi/. Valitse sieltä kohta \"kirjaudu Katso-tunnisteella\" tai Kirjaudu henkilötunnisteella. Seuraa sivulla olevia ohjeita. Onnistuneen siirron jälkeen saat kuittauksen vastaanotetusta aineistosta verottajalta."]